program: Orca
programVersion: 5.0.2
elementType: O O N C C C C C C C C C C C C C C C C C C H H H H H H H H H H H H H H H H H H H H H H H H H H H H H H H H H H H
charge: 0
multiplicity: 1
keywords: wb97x-d3
keywords: def2-TZVPP
keywords: def2/J RIJCOSX
keywords: DEFGRID2
keywords: scfconv7
keywords: smallprint printgap noloewdin
keywords: NOSOSCF
formula: C18H35NO2
InChI: InChI=1/C18H35NO2/c1-6-12-19(7-2)13-16-14-20-18(21-16)10-8-15(9-11-18)17(3,4)5/h15-16H,6-14H2,1-5H3
56 atoms
O  -0.195531 0.469697 -0.688748
O  -0.401721 2.112844 0.824705
N  -3.590062 -1.032283 -0.316815
C  3.327804 0.215345 -0.021593
C  0.538944 1.232645 0.254286
C  2.684545 1.13219 -1.06701
C  2.23264 -0.590141 0.684759
C  4.484709 -0.652708 -0.581558
C  1.613644 2.032987 -0.458635
C  1.168101 0.314642 1.298647
C  -1.588525 0.547198 -0.398631
C  -1.633102 1.418077 0.858655
C  4.004171 -1.646535 -1.639939
C  5.554708 0.249913 -1.204771
C  5.145548 -1.432287 0.55955
C  -2.149617 -0.871495 -0.250285
C  -4.318495 -0.456563 0.804764
C  -4.176947 -0.579837 -1.573426
C  -4.026369 -1.088822 2.157294
C  -3.525747 -1.154954 -2.81689
C  -4.903764 -0.482356 3.242567
H  3.781558 0.86991 0.737562
H  3.435148 1.770452 -1.534719
H  2.246286 0.536059 -1.872705
H  1.759881 -1.282857 -0.017724
H  2.658386 -1.203948 1.47959
H  1.15604 2.658187 -1.229915
H  2.077386 2.707066 0.26773
H  1.623734 0.938275 2.073853
H  0.399062 -0.290589 1.787886
H  -2.079677 1.063602 -1.230988
H  -1.724356 0.813832 1.769014
H  -2.445971 2.143923 0.847417
H  4.8467 -2.222155 -2.029995
H  3.285948 -2.362479 -1.236793
H  3.534953 -1.148857 -2.490422
H  5.206565 0.745175 -2.111796
H  6.435296 -0.335089 -1.478706
H  5.880123 1.025165 -0.5066
H  6.028323 -1.963695 0.19752
H  5.470468 -0.765249 1.361905
H  4.481195 -2.178447 0.996977
H  -1.78785 -1.29584 0.689807
H  -1.703843 -1.48554 -1.035446
H  -4.185283 0.635472 0.87739
H  -5.382986 -0.600514 0.597666
H  -5.226534 -0.884414 -1.563468
H  -4.191495 0.518109 -1.655088
H  -2.97833 -0.958562 2.435784
H  -4.201742 -2.165591 2.098509
H  -2.521304 -0.767365 -2.989225
H  -3.466689 -2.243046 -2.774068
H  -4.12353 -0.891864 -3.689709
H  -5.963391 -0.627338 3.024875
H  -4.731491 0.591276 3.337652
H  -4.702632 -0.933757 4.214102
elementType: O N C H
totalener: -912.30311381 hartree
nucrepener: 1893.95409738 hartree
electener: -2806.25721118 hartree
oneelecener: -5001.10227713 hartree
twoeener: 2194.84506595 hartree
cpcmener: -0.02087948 hartree
kineticenergy: 907.80313272 hartree
xcener: -92.075340426464 hartree
chargesum: -0.0000000
charge: -0.442973 -0.409809 -0.188715 0.091156 0.600239 -0.220116 -0.250281 0.264481 -0.277286 -0.297798 0.184013 -0.009165 -0.377262 -0.361656 -0.362371 -0.216588 -0.130958 -0.072447 -0.072872 -0.264739 -0.281970 0.057830 0.089983 0.077118 0.083572 0.090143 0.081821 0.085741 0.087682 0.092117 0.096246 0.099603 0.111858 0.098637 0.095302 0.097327 0.094928 0.095386 0.099369 0.096152 0.098685 0.094677 0.111699 0.096671 0.074553 0.098903 0.085125 0.069650 0.060615 0.060512 0.082284 0.081206 0.096005 0.081816 0.080857 0.093041
qa: -0.4430 -0.4098 -0.1887 0.0912 0.6002 -0.2201 -0.2503 0.2645 -0.2773 -0.2978 0.1840 -0.0092 -0.3773 -0.3617 -0.3624 -0.2166 -0.1310 -0.0724 -0.0729 -0.2647 -0.2820 0.0578 0.0900 0.0771 0.0836 0.0901 0.0818 0.0857 0.0877 0.0921 0.0962 0.0996 0.1119 0.0986 0.0953 0.0973 0.0949 0.0954 0.0994 0.0962 0.0987 0.0947 0.1117 0.0967 0.0746 0.0989 0.0851 0.0696 0.0606 0.0605 0.0823 0.0812 0.0960 0.0818 0.0809 0.0930
va: 1.9563 1.9972 2.9369 3.6815 3.7442 3.9067 3.9507 3.6682 4.0568 4.0126 3.6665 3.9491 3.9444 3.9229 3.9231 4.0612 3.9478 3.9206 3.8201 3.9064 3.9510 1.0170 1.0127 1.0220 1.0148 1.0133 1.0274 1.0163 1.0214 1.0132 0.9967 0.9993 0.9980 1.0040 1.0005 1.0004 0.9985 1.0069 1.0028 1.0062 1.0028 0.9998 0.9924 1.0076 0.9958 1.0005 0.9936 0.9921 1.0108 1.0208 1.0013 1.0101 1.0053 1.0011 1.0006 1.0040
dispcorr: -0.028990074 hartree
energy: -912.332103880006
dipole: 3.09071 -3.48660 -0.39589 -8.45908 8.45072 -0.00836 -0.08689 0.41319 0.32630
magnitude: 0.51310 au
magnitude: 1.30420 debye
