program: Orca
programVersion: 5.0.2
elementType: O O N C C C C C C C C C C C C C C C C C C H H H H H H H H H H H H H H H H H H H H H H H H H H H H H H H H H H H
charge: 0
multiplicity: 1
keywords: wb97x-d3
keywords: def2-TZVPP
keywords: def2/J RIJCOSX
keywords: DEFGRID2
keywords: scfconv7
keywords: smallprint printgap noloewdin
keywords: NOSOSCF
formula: C18H35NO2
InChI: InChI=1/C18H35NO2/c1-6-12-19(7-2)13-16-14-20-18(21-16)10-8-15(9-11-18)17(3,4)5/h15-16H,6-14H2,1-5H3
56 atoms
O  -0.284567 0.882216 -0.623065
O  -0.293188 2.386553 1.064066
N  -2.688054 -0.769526 0.087916
C  3.167304 0.121922 0.010246
C  0.527456 1.454473 0.391612
C  2.661511 1.218989 -0.930886
C  1.968463 -0.606843 0.624401
C  4.211086 -0.826842 -0.634435
C  1.707456 2.182243 -0.230262
C  1.017488 0.35718 1.327919
C  -1.603336 1.404367 -0.542369
C  -1.639183 2.000009 0.852939
C  3.619987 -1.648143 -1.781717
C  5.391126 -0.011339 -1.171532
C  4.75875 -1.786254 0.426576
C  -2.652669 0.3464 -0.840707
C  -4.033441 -1.101483 0.531512
C  -1.945842 -1.935595 -0.373026
C  -4.603662 -0.105052 1.530371
C  -2.55932 -2.722839 -1.527286
C  -6.028187 -0.460717 1.926957
H  3.691044 0.627051 0.835562
H  3.494396 1.799511 -1.329926
H  2.158855 0.772395 -1.79411
H  1.42657 -1.159573 -0.149186
H  2.299365 -1.350344 1.351074
H  1.3441 2.937755 -0.932363
H  2.245142 2.712574 0.561623
H  1.539486 0.830347 2.165239
H  0.166729 -0.186537 1.748038
H  -1.726082 2.201562 -1.288213
H  -1.968832 1.269829 1.598044
H  -2.277347 2.881084 0.922111
H  4.390069 -2.280581 -2.229634
H  2.818353 -2.308564 -1.446689
H  3.219393 -1.018081 -2.577965
H  5.8064 0.644293 -0.401936
H  5.116435 0.610379 -2.02449
H  6.19298 -0.673671 -1.505213
H  5.574215 -2.386045 0.016254
H  5.152911 -1.241208 1.288014
H  4.003375 -2.482524 0.792707
H  -2.522071 0.015611 -1.879046
H  -3.612973 0.868371 -0.833303
H  -4.735556 -1.205373 -0.311131
H  -3.994812 -2.082582 1.013832
H  -0.94221 -1.615586 -0.655301
H  -1.814258 -2.609172 0.478693
H  -4.588793 0.905547 1.112008
H  -3.964082 -0.080773 2.416642
H  -2.7058 -2.107502 -2.416589
H  -1.897281 -3.543753 -1.806774
H  -3.522926 -3.158877 -1.260731
H  -6.42915 0.250331 2.6498
H  -6.080953 -1.453108 2.378663
H  -6.693944 -0.458363 1.061928
elementType: O N C H
totalener: -912.30100230 hartree
nucrepener: 1917.61471030 hartree
electener: -2829.91571260 hartree
oneelecener: -5049.20460979 hartree
twoeener: 2219.28889719 hartree
cpcmener: -0.01874703 hartree
kineticenergy: 907.81165921 hartree
xcener: -92.076658243424 hartree
chargesum: -0.0000000
charge: -0.443923 -0.417394 -0.229041 0.096516 0.615116 -0.222880 -0.256944 0.273888 -0.280889 -0.288755 0.207032 -0.024655 -0.383355 -0.360233 -0.365328 -0.136525 -0.082630 -0.056979 -0.079151 -0.284509 -0.289569 0.057333 0.088893 0.075142 0.089252 0.089627 0.080822 0.083844 0.087245 0.083803 0.071814 0.078566 0.110788 0.098889 0.094298 0.099845 0.099992 0.094393 0.095236 0.095897 0.098426 0.095524 0.099083 0.101866 0.069133 0.084664 0.071939 0.080120 0.062158 0.054730 0.081633 0.094996 0.087262 0.091606 0.081457 0.079934
qa: -0.4439 -0.4174 -0.2290 0.0965 0.6151 -0.2229 -0.2569 0.2739 -0.2809 -0.2888 0.2070 -0.0247 -0.3834 -0.3602 -0.3653 -0.1365 -0.0826 -0.0570 -0.0792 -0.2845 -0.2896 0.0573 0.0889 0.0751 0.0893 0.0896 0.0808 0.0838 0.0872 0.0838 0.0718 0.0786 0.1108 0.0989 0.0943 0.0998 0.1000 0.0944 0.0952 0.0959 0.0984 0.0955 0.0991 0.1019 0.0691 0.0847 0.0719 0.0801 0.0622 0.0547 0.0816 0.0950 0.0873 0.0916 0.0815 0.0799
va: 1.9647 1.9809 2.8400 3.6769 3.7096 3.9132 3.9641 3.6555 4.0688 4.0193 3.8910 3.9681 3.9472 3.9206 3.9227 3.9201 3.9124 3.9432 3.8429 3.9196 3.9677 1.0176 1.0135 1.0228 0.9926 1.0142 1.0224 1.0168 1.0242 1.0223 1.0059 1.0198 0.9965 1.0047 1.0006 0.9998 1.0022 0.9986 1.0070 1.0060 1.0029 0.9991 1.0075 1.0012 0.9908 0.9961 1.0048 0.9974 1.0102 1.0153 1.0031 1.0088 0.9988 1.0035 0.9999 1.0018
dispcorr: -0.029823299 hartree
energy: -912.330825602676
dipole: 0.85752 -1.61050 -0.75298 -13.36818 12.99885 -0.36933 -2.39256 2.12955 -0.26301
magnitude: 0.87895 au
magnitude: 2.23411 debye
