program: Orca
programVersion: 5.0.2
elementType: O O N C C C C C C C C C C C C C C C C C C H H H H H H H H H H H H H H H H H H H H H H H H H H H H H H H H H H H
charge: 0
multiplicity: 1
keywords: wb97x-d3
keywords: def2-TZVPP
keywords: def2/J RIJCOSX
keywords: DEFGRID2
keywords: scfconv7
keywords: smallprint printgap noloewdin
keywords: NOSOSCF
formula: C18H35NO2
InChI: InChI=1/C18H35NO2/c1-6-12-19(7-2)13-16-14-20-18(21-16)10-8-15(9-11-18)17(3,4)5/h15-16H,6-14H2,1-5H3
56 atoms
O  -0.147319 0.903201 -0.685994
O  -0.357939 2.211803 1.121366
N  -3.579904 -0.399207 -0.148974
C  3.275549 0.179922 0.160778
C  0.559589 1.380033 0.448464
C  2.79551 1.339626 -0.717259
C  2.066277 -0.641742 0.617379
C  4.399083 -0.672213 -0.48494
C  1.751487 2.19929 -0.009026
C  1.024952 0.220268 1.325667
C  -1.545469 0.972702 -0.432592
C  -1.634441 1.625935 0.947646
C  4.907904 -1.704759 0.525635
C  3.92272 -1.407649 -1.73956
C  5.581262 0.225441 -0.86276
C  -2.167499 -0.412793 -0.482825
C  -4.070547 -1.741664 0.1327
C  -4.410013 0.296581 -1.12625
C  -3.6205 -2.305366 1.476035
C  -4.435058 -0.265964 -2.543278
C  -4.031118 -1.459481 2.66985
H  3.718566 0.627283 1.0630
H  3.629755 1.985471 -0.994205
H  2.380431 0.957705 -1.65464
H  1.60456 -1.140657 -0.239579
H  2.374854 -1.434007 1.300944
H  1.412523 3.007188 -0.662754
H  2.204854 2.665913 0.870489
H  1.461774 0.638495 2.237801
H  0.176672 -0.396874 1.635577
H  -1.986241 1.621577 -1.195983
H  -1.849582 0.887801 1.729554
H  -2.391923 2.40727 1.003029
H  5.777589 -2.232505 0.127953
H  5.211985 -1.229045 1.461417
H  4.15883 -2.459917 0.766278
H  3.118303 -2.112602 -1.524321
H  4.743411 -1.980824 -2.177155
H  3.564877 -0.720993 -2.508896
H  5.916441 0.824999 -0.012584
H  6.429579 -0.378437 -1.192423
H  5.342355 0.910025 -1.677489
H  -1.646302 -1.030944 0.252038
H  -1.967645 -0.870269 -1.464242
H  -5.163448 -1.700316 0.133324
H  -3.792823 -2.45509 -0.6588
H  -5.429611 0.307128 -0.733601
H  -4.105717 1.345157 -1.164915
H  -2.539147 -2.463816 1.489005
H  -4.061695 -3.301314 1.565901
H  -5.121224 0.320288 -3.156009
H  -3.457716 -0.226201 -3.026088
H  -4.780267 -1.300583 -2.5689
H  -5.106834 -1.273873 2.671757
H  -3.529844 -0.492056 2.672476
H  -3.782759 -1.956666 3.608396
elementType: O N C H
totalener: -912.30151807 hartree
nucrepener: 1899.81496847 hartree
electener: -2812.11648653 hartree
oneelecener: -5013.06374597 hartree
twoeener: 2200.94725944 hartree
cpcmener: -0.01948501 hartree
kineticenergy: 907.80581546 hartree
xcener: -92.076021984554 hartree
chargesum: 0.0000000
charge: -0.447782 -0.411184 -0.209800 0.091927 0.588399 -0.219024 -0.247154 0.264253 -0.271009 -0.302524 0.276613 -0.020923 -0.363383 -0.378715 -0.361569 -0.266477 -0.093074 -0.057817 -0.094759 -0.283531 -0.287141 0.056264 0.089069 0.076564 0.082636 0.089520 0.080642 0.084905 0.089534 0.094043 0.092166 0.088181 0.108151 0.096093 0.098712 0.094898 0.095595 0.099005 0.097915 0.099830 0.095597 0.094060 0.115036 0.093208 0.091310 0.079622 0.080308 0.081458 0.057956 0.072606 0.096819 0.085081 0.087938 0.082026 0.074641 0.093281
qa: -0.4478 -0.4112 -0.2098 0.0919 0.5884 -0.2190 -0.2472 0.2643 -0.2710 -0.3025 0.2766 -0.0209 -0.3634 -0.3787 -0.3616 -0.2665 -0.0931 -0.0578 -0.0948 -0.2835 -0.2871 0.0563 0.0891 0.0766 0.0826 0.0895 0.0806 0.0849 0.0895 0.0940 0.0922 0.0882 0.1082 0.0961 0.0987 0.0949 0.0956 0.0990 0.0979 0.0998 0.0956 0.0941 0.1150 0.0932 0.0913 0.0796 0.0803 0.0815 0.0580 0.0726 0.0968 0.0851 0.0879 0.0820 0.0746 0.0933
va: 1.9675 1.9961 2.8258 3.6826 3.7608 3.9069 3.9466 3.6670 4.0541 4.0131 3.7031 3.9874 3.9225 3.9450 3.9226 4.1103 3.9141 3.9354 3.8535 3.9022 3.9397 1.0178 1.0123 1.0226 1.0150 1.0137 1.0293 1.0162 1.0219 1.0080 0.9967 1.0063 0.9938 1.0061 1.0028 0.9997 1.0003 1.0039 1.0004 1.0023 1.0070 0.9987 0.9862 1.0112 0.9935 1.0031 0.9999 0.9956 1.0102 1.0108 1.0092 0.9983 0.9989 1.0014 1.0105 1.0062
dispcorr: -0.029345539 hartree
energy: -912.330863605994
dipole: 2.68645 -3.19701 -0.51056 -12.42222 11.65970 -0.76252 -2.08142 1.97990 -0.10152
magnitude: 0.92327 au
magnitude: 2.34676 debye
