program: Orca
programVersion: 5.0.2
elementType: O O N C C C C C C C C C C C C C C C C C C H H H H H H H H H H H H H H H H H H H H H H H H H H H H H H H H H H H
charge: 0
multiplicity: 1
keywords: wb97x-d3
keywords: def2-TZVPP
keywords: def2/J RIJCOSX
keywords: DEFGRID2
keywords: scfconv7
keywords: smallprint printgap noloewdin
keywords: NOSOSCF
formula: C18H35NO2
InChI: InChI=1/C18H35NO2/c1-6-12-19(7-2)13-16-14-20-18(21-16)10-8-15(9-11-18)17(3,4)5/h15-16H,6-14H2,1-5H3
56 atoms
O  -0.015157 -0.244914 0.183926
O  -0.29259 1.79263 1.105367
N  -3.641395 -0.655365 -0.32486
C  3.556423 0.411449 -0.086681
C  0.68712 0.916773 0.56798
C  2.519198 0.723833 -1.168876
C  2.853768 -0.288369 1.079555
C  4.809641 -0.336077 -0.61443
C  1.373283 1.572758 -0.626365
C  1.706216 0.552754 1.6331
C  -1.330015 0.151994 -0.170906
C  -1.586641 1.308784 0.787317
C  4.4578 -1.670405 -1.273979
C  5.537019 0.541912 -1.637543
C  5.784151 -0.60004 0.537398
C  -2.274009 -1.020581 0.013105
C  -4.601355 -1.44081 0.441812
C  -3.872636 -0.785933 -1.759987
C  -4.737385 -1.018516 1.898771
C  -5.072806 -0.003966 -2.262433
C  -5.252428 0.399802 2.084226
H  3.923092 1.375103 0.297546
H  2.974815 1.257707 -2.004451
H  2.119998 -0.206743 -1.583463
H  2.476588 -1.265657 0.762577
H  3.55276 -0.480441 1.894644
H  0.643342 1.775279 -1.415691
H  1.763332 2.543182 -0.305214
H  2.111214 1.48122 2.046023
H  1.206383 0.029417 2.452616
H  -1.350568 0.50574 -1.210011
H  -2.095324 0.967855 1.69655
H  -2.184944 2.102258 0.337199
H  5.365418 -2.185553 -1.596949
H  3.932696 -2.341251 -0.59139
H  3.831513 -1.53937 -2.157922
H  5.784532 1.519785 -1.217077
H  4.949064 0.709414 -2.540794
H  6.472987 0.071985 -1.947743
H  6.733253 -0.980043 0.153204
H  5.999631 0.31416 1.09615
H  5.407693 -1.340284 1.244617
H  -2.224331 -1.322798 1.060877
H  -1.924967 -1.882931 -0.575808
H  -5.582237 -1.336784 -0.026292
H  -4.357658 -2.514768 0.394056
H  -2.989079 -0.418624 -2.285065
H  -3.973103 -1.844846 -2.047764
H  -3.787622 -1.137966 2.426746
H  -5.427448 -1.720305 2.37387
H  -6.012137 -0.344273 -1.827238
H  -4.968831 1.059554 -2.047158
H  -5.1599 -0.116868 -3.343085
H  -6.207716 0.543733 1.5759
H  -4.556318 1.140496 1.692263
H  -5.406601 0.625418 3.139935
elementType: O N C H
totalener: -912.30301383 hartree
nucrepener: 1871.44822308 hartree
electener: -2783.75123691 hartree
oneelecener: -4956.38818872 hartree
twoeener: 2172.63695181 hartree
cpcmener: -0.01900335 hartree
kineticenergy: 907.80560645 hartree
xcener: -92.071048483059 hartree
chargesum: -0.0000000
charge: -0.433485 -0.434049 -0.245103 0.087898 0.610269 -0.241089 -0.227416 0.263465 -0.286692 -0.258470 0.175398 0.025369 -0.376364 -0.360828 -0.362959 -0.147900 -0.107896 -0.046018 -0.091772 -0.267519 -0.290139 0.056817 0.087265 0.081164 0.079385 0.087533 0.090681 0.086843 0.082379 0.080979 0.077967 0.075659 0.086023 0.098798 0.098149 0.095197 0.097748 0.094929 0.095444 0.095393 0.100138 0.093572 0.101474 0.093277 0.099824 0.088151 0.086135 0.066816 0.060500 0.074951 0.081227 0.073458 0.092773 0.084482 0.074152 0.096018
qa: -0.4335 -0.4340 -0.2451 0.0879 0.6103 -0.2411 -0.2274 0.2635 -0.2867 -0.2585 0.1754 0.0254 -0.3764 -0.3608 -0.3630 -0.1479 -0.1079 -0.0460 -0.0918 -0.2675 -0.2901 0.0568 0.0873 0.0812 0.0794 0.0875 0.0907 0.0868 0.0824 0.0810 0.0780 0.0757 0.0860 0.0988 0.0981 0.0952 0.0977 0.0949 0.0954 0.0954 0.1001 0.0936 0.1015 0.0933 0.0998 0.0882 0.0861 0.0668 0.0605 0.0750 0.0812 0.0735 0.0928 0.0845 0.0742 0.0960
va: 1.9794 1.9754 2.7878 3.6754 3.7351 3.9505 3.9178 3.6639 4.0499 4.0433 3.8692 3.9689 3.9453 3.9224 3.9256 3.9430 3.9031 3.8903 3.8464 3.9322 3.9381 1.0169 1.0147 1.0146 1.0176 1.0125 1.0091 1.0217 1.0187 1.0273 1.0059 1.0010 0.9976 1.0042 1.0007 0.9992 1.0032 1.0013 1.0058 1.0068 1.0020 0.9981 1.0070 1.0142 0.9897 1.0114 0.9901 1.0084 1.0104 1.0120 1.0033 1.0107 1.0078 1.0016 1.0059 1.0048
dispcorr: -0.028412406 hartree
energy: -912.331426236626
dipole: 0.96641 -1.37784 -0.41143 -5.02518 4.54979 -0.47539 -4.39067 3.79778 -0.59289
magnitude: 0.86417 au
magnitude: 2.19655 debye
