program: Orca
programVersion: 5.0.2
elementType: O O N C C C C C C C C C C C C C C C C C C H H H H H H H H H H H H H H H H H H H H H H H H H H H H H H H H H H H
charge: 0
multiplicity: 1
keywords: wb97x-d3
keywords: def2-TZVPP
keywords: def2/J RIJCOSX
keywords: DEFGRID2
keywords: scfconv7
keywords: smallprint printgap noloewdin
keywords: NOSOSCF
formula: C18H35NO2
InChI: InChI=1/C18H35NO2/c1-6-12-19(7-2)13-16-14-20-18(21-16)10-8-15(9-11-18)17(3,4)5/h15-16H,6-14H2,1-5H3
56 atoms
O  -0.375209 0.964605 -0.716286
O  -0.46578 2.681092 0.756472
N  -3.085772 -0.233575 -0.406523
C  2.880764 0.03873 0.423959
C  0.350237 1.613636 0.314975
C  2.597616 1.059069 -0.683317
C  1.555344 -0.505053 0.968789
C  3.888176 -1.064584 0.005573
C  1.657621 2.170837 -0.225943
C  0.630408 0.617493 1.431771
C  -1.569266 1.678396 -0.989257
C  -1.785775 2.453525 0.297146
C  4.178032 -1.981337 1.197204
C  3.369696 -1.916992 -1.15414
C  5.214654 -0.4218 -0.41202
C  -2.705127 0.757051 -1.399462
C  -2.388738 -1.502744 -0.592936
C  -4.53008 -0.423569 -0.351933
C  -2.207669 -2.290239 0.696478
C  -5.265119 0.720155 0.322914
C  -1.44455 -3.58631 0.469004
H  3.360223 0.587496 1.248085
H  3.52462 1.520153 -1.026847
H  2.166327 0.557328 -1.554359
H  1.04909 -1.10673 0.206797
H  1.730737 -1.172095 1.814065
H  1.452545 2.857802 -1.051929
H  2.1393 2.755368 0.563891
H  1.101618 1.156387 2.259221
H  -0.306991 0.205268 1.815321
H  -1.40439 2.378195 -1.820478
H  -2.371745 1.87931 1.021564
H  -2.277364 3.412971 0.13391
H  4.974764 -2.686446 0.950101
H  4.504266 -1.409771 2.06983
H  3.309973 -2.571844 1.492868
H  3.193031 -1.325245 -2.05397
H  2.438116 -2.429836 -0.906614
H  4.100905 -2.68563 -1.414631
H  5.599772 0.239553 0.368259
H  5.970606 -1.18882 -0.594273
H  5.126908 0.162852 -1.328449
H  -2.45952 0.29147 -2.364328
H  -3.550817 1.41574 -1.610288
H  -2.903438 -2.131485 -1.3382
H  -1.401205 -1.304214 -1.009201
H  -4.948536 -0.593613 -1.356823
H  -4.731956 -1.335416 0.212816
H  -3.178241 -2.513628 1.14771
H  -1.667395 -1.671644 1.418136
H  -4.963229 0.82195 1.365845
H  -5.094504 1.678394 -0.170266
H  -6.340117 0.536183 0.303337
H  -1.955069 -4.23444 -0.245503
H  -1.331513 -4.147092 1.397345
H  -0.442352 -3.393061 0.07997
elementType: O N C H
totalener: -912.30181751 hartree
nucrepener: 1946.15421427 hartree
electener: -2858.45603178 hartree
oneelecener: -5106.29629906 hartree
twoeener: 2247.84026727 hartree
cpcmener: -0.01858351 hartree
kineticenergy: 907.79928257 hartree
xcener: -92.071374604350 hartree
chargesum: 0.0000000
charge: -0.436423 -0.419463 -0.234710 0.104485 0.623574 -0.228772 -0.241895 0.269485 -0.284766 -0.294942 0.194795 -0.009912 -0.363684 -0.378934 -0.362484 -0.131539 -0.124924 -0.055392 -0.088473 -0.276160 -0.278324 0.059344 0.088431 0.077291 0.060917 0.094682 0.082245 0.085316 0.091211 0.094692 0.070973 0.066453 0.105444 0.095483 0.099287 0.094550 0.097863 0.094636 0.098454 0.099044 0.095294 0.094184 0.097401 0.106364 0.081992 0.093850 0.072055 0.086033 0.073414 0.052179 0.077107 0.084190 0.097005 0.085289 0.092972 0.072815
qa: -0.4364 -0.4195 -0.2347 0.1045 0.6236 -0.2288 -0.2419 0.2695 -0.2848 -0.2949 0.1948 -0.0099 -0.3637 -0.3789 -0.3625 -0.1315 -0.1249 -0.0554 -0.0885 -0.2762 -0.2783 0.0593 0.0884 0.0773 0.0609 0.0947 0.0822 0.0853 0.0912 0.0947 0.0710 0.0665 0.1054 0.0955 0.0993 0.0945 0.0979 0.0946 0.0985 0.0990 0.0953 0.0942 0.0974 0.1064 0.0820 0.0939 0.0721 0.0860 0.0734 0.0522 0.0771 0.0842 0.0970 0.0853 0.0930 0.0728
va: 1.9683 1.9767 2.8057 3.6966 3.6787 3.9212 3.9658 3.6609 4.0778 4.0200 3.9057 3.9605 3.9228 3.9508 3.9219 3.9027 3.9038 3.8886 3.8554 3.9187 3.9533 1.0168 1.0143 1.0206 1.0064 1.0102 1.0193 1.0167 1.0240 1.0144 1.0063 1.0286 0.9958 1.0067 1.0025 0.9987 0.9996 0.9986 1.0047 1.0029 1.0066 0.9994 1.0094 0.9986 1.0077 1.0026 1.0053 0.9923 1.0125 1.0152 1.0079 1.0017 1.0099 1.0024 1.0037 0.9990
dispcorr: -0.030913092 hartree
energy: -912.332730604860
dipole: 4.00868 -4.67175 -0.66307 -15.37131 15.13658 -0.23473 0.15234 -0.63333 -0.48100
magnitude: 0.85213 au
magnitude: 2.16594 debye
