program: Orca
programVersion: 5.0.2
elementType: O O N C C C C C C C C C C C C C C C C C C H H H H H H H H H H H H H H H H H H H H H H H H H H H H H H H H H H H
charge: 0
multiplicity: 1
keywords: wb97x-d3
keywords: def2-TZVPP
keywords: def2/J RIJCOSX
keywords: DEFGRID2
keywords: scfconv7
keywords: smallprint printgap noloewdin
keywords: NOSOSCF
formula: C18H35NO2
InChI: InChI=1/C18H35NO2/c1-6-12-19(7-2)13-16-14-20-18(21-16)10-8-15(9-11-18)17(3,4)5/h15-16H,6-14H2,1-5H3
56 atoms
O  -0.096705 0.220312 -0.61698
O  -0.250406 2.45959 -0.457696
N  -3.663905 -0.197997 0.296486
C  3.416898 0.396099 0.226339
C  0.655281 1.3880 -0.318807
C  2.836482 0.45949 -1.189536
C  2.269921 0.20111 1.22278
C  4.572809 -0.625999 0.386842
C  1.779664 1.551971 -1.325412
C  1.218284 1.300282 1.096561
C  -1.487721 0.517474 -0.580913
C  -1.52595 1.964979 -0.099374
C  4.11005 -2.065738 0.156948
C  5.692368 -0.304303 -0.60834
C  5.166646 -0.519333 1.794837
C  -2.227245 -0.447309 0.330998
C  -4.4136 -1.249142 -0.371894
C  -4.221321 0.146942 1.596612
C  -4.134126 -1.353091 -1.863658
C  -4.253136 -0.962571 2.641511
C  -4.962124 -2.45443 -2.508681
H  3.857175 1.382702 0.434554
H  3.620414 0.656348 -1.922195
H  2.400712 -0.507052 -1.460135
H  1.798624 -0.774168 1.067554
H  2.641575 0.200356 2.248444
H  1.367011 1.562459 -2.337735
H  2.24765 2.526998 -1.159785
H  1.673257 2.264205 1.344484
H  0.411194 1.134241 1.81638
H  -1.890392 0.443519 -1.597678
H  -1.690423 2.026609 0.983856
H  -2.290017 2.562941 -0.594364
H  4.94947 -2.755986 0.26876
H  3.345206 -2.372183 0.87256
H  3.704515 -2.213673 -0.845647
H  6.012208 0.737497 -0.525617
H  5.395975 -0.478899 -1.64331
H  6.565887 -0.931336 -0.416836
H  6.046297 -1.160013 1.887685
H  5.480832 0.503439 2.017606
H  4.464392 -0.827209 2.570424
H  -1.837419 -0.328023 1.347287
H  -1.995997 -1.478479 0.040958
H  -4.236628 -2.23661 0.083735
H  -5.478148 -1.035685 -0.235477
H  -3.656631 0.995452 1.990364
H  -5.239326 0.513833 1.439352
H  -3.073635 -1.5552 -2.037381
H  -4.351692 -0.395695 -2.343968
H  -4.882183 -1.7984 2.333002
H  -3.256353 -1.354304 2.853098
H  -4.658494 -0.57833 3.578749
H  -6.031506 -2.273831 -2.384703
H  -4.740334 -3.42824 -2.068245
H  -4.763634 -2.526012 -3.578325
elementType: O N C H
totalener: -912.30259171 hartree
nucrepener: 1873.18528884 hartree
electener: -2785.48788056 hartree
oneelecener: -4959.88317894 hartree
twoeener: 2174.39529838 hartree
cpcmener: -0.01931816 hartree
kineticenergy: 907.80334178 hartree
xcener: -92.071576097155 hartree
chargesum: 0.0000000
charge: -0.447776 -0.409666 -0.240698 0.088414 0.601734 -0.219905 -0.239983 0.264285 -0.278127 -0.297501 0.210260 -0.006002 -0.377778 -0.362480 -0.362122 -0.167236 -0.096216 -0.044918 -0.068107 -0.279889 -0.288190 0.057986 0.088647 0.077696 0.080251 0.089483 0.081035 0.085400 0.085439 0.091573 0.089510 0.084989 0.102461 0.098378 0.096735 0.097301 0.099993 0.094527 0.095461 0.095847 0.098848 0.094809 0.102995 0.096482 0.067010 0.084765 0.078957 0.077418 0.058896 0.053271 0.086403 0.081074 0.095527 0.080994 0.079655 0.092085
qa: -0.4478 -0.4097 -0.2407 0.0884 0.6017 -0.2199 -0.2400 0.2643 -0.2781 -0.2975 0.2103 -0.0060 -0.3778 -0.3625 -0.3621 -0.1672 -0.0962 -0.0449 -0.0681 -0.2799 -0.2882 0.0580 0.0886 0.0777 0.0803 0.0895 0.0810 0.0854 0.0854 0.0916 0.0895 0.0850 0.1025 0.0984 0.0967 0.0973 0.1000 0.0945 0.0955 0.0958 0.0988 0.0948 0.1030 0.0965 0.0670 0.0848 0.0790 0.0774 0.0589 0.0533 0.0864 0.0811 0.0955 0.0810 0.0797 0.0921
va: 1.9671 1.9943 2.8382 3.6813 3.7410 3.9048 3.9420 3.6657 4.0675 4.0281 3.8281 3.9485 3.9447 3.9230 3.9226 3.9188 3.9532 3.9334 3.8258 3.8983 3.9624 1.0170 1.0136 1.0215 1.0182 1.0138 1.0268 1.0166 1.0217 1.0113 1.0037 1.0052 1.0035 1.0043 0.9998 1.0003 1.0025 0.9990 1.0066 1.0062 1.0028 1.0001 0.9932 1.0077 0.9927 0.9957 0.9962 1.0002 1.0101 1.0191 0.9991 1.0033 1.0092 1.0006 1.0018 1.0036
dispcorr: -0.028179169 hartree
energy: -912.330770881208
dipole: 1.87464 -2.34412 -0.46947 -12.82523 12.38812 -0.43712 3.97779 -3.22667 0.75112
magnitude: 0.98775 au
magnitude: 2.51067 debye
