program: Orca
programVersion: 5.0.2
elementType: O O N C C C C C C C C C C C C C C C C C C H H H H H H H H H H H H H H H H H H H H H H H H H H H H H H H H H H H
charge: 0
multiplicity: 1
keywords: wb97x-d3
keywords: def2-TZVPP
keywords: def2/J RIJCOSX
keywords: DEFGRID2
keywords: scfconv7
keywords: smallprint printgap noloewdin
keywords: NOSOSCF
formula: C18H35NO2
InChI: InChI=1/C18H35NO2/c1-6-12-19(7-2)13-16-14-20-18(21-16)10-8-15(9-11-18)17(3,4)5/h15-16H,6-14H2,1-5H3
56 atoms
O  -0.315308 0.567579 0.3777
O  -0.114638 2.779881 0.644129
N  -2.96502 -0.914975 -0.426688
C  3.282987 0.289395 -0.009222
C  0.638688 1.602679 0.406965
C  2.286345 0.485632 -1.155006
C  2.50249 0.154695 1.30156
C  4.311878 -0.84644 -0.244552
C  1.39637 1.701045 -0.914786
C  1.602635 1.361852 1.553423
C  -1.480505 1.096961 -0.234931
C  -1.452874 2.553731 0.237718
C  3.656658 -2.228223 -0.277206
C  5.045295 -0.616688 -1.569493
C  5.361508 -0.823571 0.869886
C  -2.738874 0.376121 0.199012
C  -4.35124 -1.335846 -0.248264
C  -2.027579 -1.952545 -0.006156
C  -5.330034 -0.642843 -1.186663
C  -1.98253 -2.286816 1.481154
C  -6.752924 -1.137909 -0.975862
H  3.871013 1.216777 0.060221
H  2.806018 0.627893 -2.103313
H  1.66694 -0.408943 -1.276077
H  1.896575 -0.756337 1.285227
H  3.180141 0.054925 2.150765
H  0.700814 1.833241 -1.748616
H  2.017955 2.60094 -0.883582
H  2.22203 2.255511 1.671169
H  1.041803 1.235017 2.483186
H  -1.395544 1.047762 -1.327054
H  -2.122887 2.714683 1.088769
H  -1.74486 3.240726 -0.559733
H  3.198167 -2.488632 0.678245
H  2.88415 -2.298717 -1.045402
H  4.400716 -2.997549 -0.496315
H  5.874048 -1.320324 -1.674498
H  5.463016 0.391831 -1.624561
H  4.397935 -0.755128 -2.436294
H  4.939493 -1.06243 1.846748
H  6.14822 -1.555417 0.673588
H  5.837515 0.157233 0.945799
H  -3.563658 1.032493 -0.087726
H  -2.76401 0.336345 1.299564
H  -4.402208 -2.41005 -0.443871
H  -4.693476 -1.202004 0.790043
H  -2.284195 -2.858222 -0.560567
H  -1.026373 -1.683585 -0.344865
H  -5.025475 -0.824917 -2.22016
H  -5.303688 0.440377 -1.042485
H  -1.63138 -1.451968 2.088502
H  -2.95754 -2.592248 1.864078
H  -1.293786 -3.11651 1.646872
H  -6.832083 -2.211042 -1.159242
H  -7.450607 -0.638268 -1.648393
H  -7.092337 -0.953027 0.044994
elementType: O N C H
totalener: -912.30392232 hartree
nucrepener: 1894.35392944 hartree
electener: -2806.65785176 hartree
oneelecener: -5002.36262180 hartree
twoeener: 2195.70477005 hartree
cpcmener: -0.01971982 hartree
kineticenergy: 907.81087401 hartree
xcener: -92.074153705226 hartree
chargesum: -0.0000000
charge: -0.406387 -0.421509 -0.213150 0.086537 0.563502 -0.246013 -0.230670 0.268123 -0.276198 -0.247161 0.186381 0.018983 -0.376432 -0.365427 -0.360005 -0.196303 -0.096933 -0.046011 -0.062227 -0.292342 -0.283851 0.056940 0.088451 0.081146 0.081904 0.089787 0.093421 0.086579 0.086144 0.079667 0.063129 0.081911 0.088875 0.094959 0.097394 0.098700 0.095740 0.100798 0.094397 0.094538 0.095162 0.097927 0.120974 0.090390 0.090503 0.068785 0.082767 0.072154 0.045376 0.056680 0.078368 0.093423 0.097224 0.080734 0.091976 0.080171
qa: -0.4064 -0.4215 -0.2132 0.0865 0.5635 -0.2460 -0.2307 0.2681 -0.2762 -0.2472 0.1864 0.0190 -0.3764 -0.3654 -0.3600 -0.1963 -0.0969 -0.0460 -0.0622 -0.2923 -0.2839 0.0569 0.0885 0.0811 0.0819 0.0898 0.0934 0.0866 0.0861 0.0797 0.0631 0.0819 0.0889 0.0950 0.0974 0.0987 0.0957 0.1008 0.0944 0.0945 0.0952 0.0979 0.1210 0.0904 0.0905 0.0688 0.0828 0.0722 0.0454 0.0567 0.0784 0.0934 0.0972 0.0807 0.0920 0.0802
va: 1.9800 1.9772 2.8856 3.6769 3.7796 3.9597 3.9426 3.6608 4.0219 4.0120 3.8162 3.9849 3.9463 3.9249 3.9229 3.9911 3.9234 3.9151 3.8443 3.8847 3.9508 1.0177 1.0135 1.0100 1.0074 1.0134 1.0071 1.0227 1.0180 1.0319 1.0252 0.9960 0.9949 0.9992 1.0006 1.0044 1.0067 1.0018 0.9981 1.0016 1.0059 1.0030 0.9910 1.0088 0.9954 0.9957 0.9998 1.0139 1.0230 1.0153 1.0082 1.0008 1.0083 1.0009 1.0039 1.0011
dispcorr: -0.028630141 hartree
energy: -912.332552456254
dipole: 0.85555 -1.28383 -0.42828 -13.37815 13.23671 -0.14144 -1.81544 1.59522 -0.22022
magnitude: 0.50192 au
magnitude: 1.27579 debye
