program: Orca
programVersion: 5.0.2
elementType: O O N C C C C C C C C C C C C C C C C C C H H H H H H H H H H H H H H H H H H H H H H H H H H H H H H H H H H H
charge: 0
multiplicity: 1
keywords: wb97x-d3
keywords: def2-TZVPP
keywords: def2/J RIJCOSX
keywords: DEFGRID2
keywords: scfconv7
keywords: smallprint printgap noloewdin
keywords: NOSOSCF
formula: C18H35NO2
InChI: InChI=1/C18H35NO2/c1-6-12-19(7-2)13-16-14-20-18(21-16)10-8-15(9-11-18)17(3,4)5/h15-16H,6-14H2,1-5H3
56 atoms
O  -0.465368 0.565524 -0.26938
O  -0.38278 2.733427 0.309546
N  -2.960113 -1.346286 0.552658
C  3.127599 0.350158 -0.222698
C  0.436176 1.614112 0.052001
C  2.26021 0.713678 -1.432273
C  2.225305 0.086095 0.985869
C  4.141667 -0.79166 -0.497434
C  1.332298 1.890678 -1.140503
C  1.28126 1.249669 1.269707
C  -1.770529 0.889971 0.2045
C  -1.561037 2.229467 0.905606
C  5.030609 -0.423348 -1.689099
C  5.054774 -0.97346 0.718517
C  3.448963 -2.123025 -0.795141
C  -2.346063 -0.168281 1.141801
C  -4.133585 -1.046585 -0.258019
C  -2.039582 -2.182646 -0.207796
C  -5.25231 -0.31529 0.467706
C  -0.893514 -2.760608 0.601662
C  -6.482402 -0.183658 -0.417517
H  3.730265 1.239584 0.014348
H  2.884129 0.980865 -2.28626
H  1.667206 -0.15033 -1.747012
H  1.641783 -0.824091 0.823657
H  2.822081 -0.093035 1.881484
H  0.719986 2.121159 -2.01633
H  1.932587 2.779542 -0.924593
H  1.86721 2.130711 1.549334
H  0.641308 1.009991 2.123738
H  -2.42388 1.025188 -0.664498
H  -1.443873 2.103999 1.989733
H  -2.37876 2.928448 0.731995
H  4.481957 -0.404319 -2.631529
H  5.49318 0.557599 -1.553354
H  5.836656 -1.151516 -1.803738
H  4.517947 -1.334517 1.596445
H  5.544297 -0.035048 0.991134
H  5.840023 -1.701302 0.502482
H  2.785891 -2.059406 -1.659761
H  4.190729 -2.894346 -1.014709
H  2.857406 -2.479902 0.049656
H  -3.096183 0.321708 1.767191
H  -1.560646 -0.477767 1.836267
H  -3.880185 -0.48555 -1.172266
H  -4.53165 -2.003279 -0.607995
H  -2.623898 -3.017609 -0.602406
H  -1.638781 -1.665251 -1.092517
H  -4.933148 0.683327 0.774266
H  -5.511194 -0.855738 1.381556
H  -0.321884 -3.448135 -0.022966
H  -0.198038 -2.003125 0.960752
H  -1.255862 -3.320915 1.464164
H  -6.856719 -1.159973 -0.73006
H  -6.262371 0.389141 -1.320034
H  -7.291365 0.3269 0.105042
elementType: O N C H
totalener: -912.30391419 hartree
nucrepener: 1922.36910417 hartree
electener: -2834.67301837 hartree
oneelecener: -5058.20216780 hartree
twoeener: 2223.52914944 hartree
cpcmener: -0.02063155 hartree
kineticenergy: 907.80375983 hartree
xcener: -92.075827037655 hartree
chargesum: -0.0000000
charge: -0.420453 -0.404700 -0.201803 0.096446 0.575852 -0.218346 -0.247831 0.275577 -0.271395 -0.281525 0.190866 -0.018904 -0.360182 -0.364805 -0.385850 -0.234643 -0.115937 -0.061885 -0.057805 -0.272149 -0.286556 0.058798 0.089664 0.076832 0.068305 0.090360 0.079369 0.084582 0.086559 0.092741 0.099791 0.083825 0.110507 0.094399 0.099995 0.095389 0.096117 0.098094 0.095106 0.099479 0.100406 0.092581 0.113389 0.121202 0.072415 0.090537 0.087837 0.064732 0.060522 0.057063 0.094357 0.070360 0.087587 0.080109 0.080776 0.092246
qa: -0.4205 -0.4047 -0.2018 0.0964 0.5759 -0.2183 -0.2478 0.2756 -0.2714 -0.2815 0.1909 -0.0189 -0.3602 -0.3648 -0.3859 -0.2346 -0.1159 -0.0619 -0.0578 -0.2721 -0.2866 0.0588 0.0897 0.0768 0.0683 0.0904 0.0794 0.0846 0.0866 0.0927 0.0998 0.0838 0.1105 0.0944 0.1000 0.0954 0.0961 0.0981 0.0951 0.0995 0.1004 0.0926 0.1134 0.1212 0.0724 0.0905 0.0878 0.0647 0.0605 0.0571 0.0944 0.0704 0.0876 0.0801 0.0808 0.0922
va: 1.9460 1.9989 2.9289 3.6801 3.7625 3.9125 4.0009 3.6592 4.0469 4.0172 3.7016 3.9985 3.9184 3.9225 3.9502 4.0318 3.9553 3.8889 3.8161 3.9042 3.9569 1.0172 1.0126 1.0199 1.0006 1.0160 1.0289 1.0166 1.0225 1.0114 0.9997 0.9994 0.9963 0.9983 1.0021 1.0069 0.9990 1.0029 1.0063 0.9999 1.0057 0.9995 0.9934 0.9923 0.9954 0.9973 0.9944 1.0083 1.0085 1.0186 1.0062 0.9979 1.0147 1.0011 1.0003 1.0035
dispcorr: -0.030195410 hartree
energy: -912.334109601750
dipole: 3.61326 -3.84263 -0.22937 -11.84699 11.93487 0.08788 -1.58763 1.85002 0.26239
magnitude: 0.35942 au
magnitude: 0.91358 debye
