program: Orca
programVersion: 5.0.2
elementType: O O N C C C C C C C C C C C C C C C C C C H H H H H H H H H H H H H H H H H H H H H H H H H H H H H H H H H H H
charge: 0
multiplicity: 1
keywords: wb97x-d3
keywords: def2-TZVPP
keywords: def2/J RIJCOSX
keywords: DEFGRID2
keywords: scfconv7
keywords: smallprint printgap noloewdin
keywords: NOSOSCF
formula: C18H35NO2
InChI: InChI=1/C18H35NO2/c1-6-12-19(7-2)13-16-14-20-18(21-16)10-8-15(9-11-18)17(3,4)5/h15-16H,6-14H2,1-5H3
56 atoms
O  -0.42793 0.620973 -0.309218
O  -0.343484 2.745229 0.405345
N  -2.965906 -1.316561 0.347193
C  3.143753 0.316332 -0.109444
C  0.472241 1.630245 0.11977
C  2.338007 0.771517 -1.330921
C  2.18743 0.014884 1.047948
C  4.133021 -0.841281 -0.408228
C  1.429524 1.956415 -1.01004
C  1.254526 1.182185 1.351974
C  -1.743255 0.921667 0.151944
C  -1.54895 2.223272 0.927668
C  3.41424 -2.125352 -0.827821
C  5.093322 -0.429151 -1.527968
C  4.976787 -1.134931 0.835941
C  -2.344342 -0.184149 1.016465
C  -4.156896 -0.950401 -0.41142
C  -2.053277 -2.084253 -0.491699
C  -5.312275 -0.418748 0.423891
C  -0.901032 -2.727515 0.257943
C  -6.519053 -0.100807 -0.446547
H  3.763192 1.171438 0.199456
H  3.005109 1.067474 -2.141656
H  1.736091 -0.056028 -1.717686
H  1.593207 -0.873774 0.820105
H  2.74452 -0.219337 1.956386
H  0.865371 2.257105 -1.896798
H  2.042277 2.812062 -0.711273
H  1.843676 2.034443 1.704534
H  0.573524 0.910955 2.163719
H  -2.373926 1.103908 -0.724873
H  -1.476498 2.042863 2.007881
H  -2.353125 2.938664 0.757593
H  4.140589 -2.912643 -1.04237
H  2.751861 -2.504606 -0.047446
H  2.816037 -1.986005 -1.730001
H  4.594675 -0.332477 -2.493205
H  5.881611 -1.175382 -1.649728
H  5.57804 0.525458 -1.307862
H  5.755973 -1.864927 0.605748
H  5.472299 -0.232738 1.203336
H  4.386893 -1.546776 1.6555
H  -3.0978 0.276319 1.65955
H  -1.573218 -0.544835 1.702596
H  -3.938069 -0.230074 -1.216054
H  -4.50357 -1.85421 -0.919449
H  -2.639689 -2.883636 -0.951045
H  -1.659523 -1.493144 -1.332234
H  -5.025197 0.48625 0.963733
H  -5.585255 -1.159465 1.179425
H  -1.259285 -3.37784 1.056769
H  -0.318566 -3.340499 -0.430952
H  -0.217697 -2.002262 0.696845
H  -6.856667 -0.978702 -1.000563
H  -6.287442 0.678549 -1.174596
H  -7.357924 0.251098 0.15425
elementType: O N C H
totalener: -912.30337048 hartree
nucrepener: 1922.70297006 hartree
electener: -2835.00634053 hartree
oneelecener: -5058.88356314 hartree
twoeener: 2223.87722261 hartree
cpcmener: -0.02084844 hartree
kineticenergy: 907.79866037 hartree
xcener: -92.074922517544 hartree
chargesum: -0.0000000
charge: -0.420764 -0.404440 -0.207000 0.100268 0.570885 -0.219975 -0.250587 0.272965 -0.268905 -0.280224 0.196019 -0.023176 -0.387710 -0.359967 -0.364871 -0.235859 -0.112302 -0.060369 -0.055842 -0.270706 -0.287626 0.059005 0.090348 0.076782 0.070070 0.090579 0.079427 0.085007 0.087425 0.092871 0.100646 0.083984 0.110897 0.101034 0.092976 0.099050 0.094330 0.095421 0.099820 0.095247 0.098569 0.096086 0.116257 0.119632 0.071219 0.093361 0.087954 0.065420 0.061221 0.052115 0.087181 0.094093 0.068018 0.080952 0.080896 0.092293
qa: -0.4208 -0.4044 -0.2070 0.1003 0.5709 -0.2200 -0.2506 0.2730 -0.2689 -0.2802 0.1960 -0.0232 -0.3877 -0.3600 -0.3649 -0.2359 -0.1123 -0.0604 -0.0558 -0.2707 -0.2876 0.0590 0.0903 0.0768 0.0701 0.0906 0.0794 0.0850 0.0874 0.0929 0.1006 0.0840 0.1109 0.1010 0.0930 0.0991 0.0943 0.0954 0.0998 0.0952 0.0986 0.0961 0.1163 0.1196 0.0712 0.0934 0.0880 0.0654 0.0612 0.0521 0.0872 0.0941 0.0680 0.0810 0.0809 0.0923
va: 1.9428 1.9995 2.9227 3.6766 3.7696 3.9136 4.0017 3.6628 4.0421 4.0148 3.6943 4.0017 3.9512 3.9184 3.9218 4.0250 3.9522 3.8885 3.8159 3.9052 3.9584 1.0172 1.0121 1.0203 0.9990 1.0159 1.0294 1.0164 1.0222 1.0112 1.0016 0.9992 0.9956 1.0058 0.9995 0.9993 0.9985 1.0069 1.0024 1.0066 1.0028 0.9982 0.9925 0.9918 0.9989 0.9981 0.9956 1.0069 1.0115 1.0195 1.0149 1.0063 0.9968 1.0007 1.0002 1.0037
dispcorr: -0.030277335 hartree
energy: -912.333647810373
dipole: 3.29667 -3.55357 -0.25690 -12.00169 12.06491 0.06322 -1.78645 2.05772 0.27127
magnitude: 0.37892 au
magnitude: 0.96315 debye
