program: Orca
programVersion: 5.0.2
elementType: O O N C C C C C C C C C C C C C C C C C C H H H H H H H H H H H H H H H H H H H H H H H H H H H H H H H H H H H
charge: 0
multiplicity: 1
keywords: wb97x-d3
keywords: def2-TZVPP
keywords: def2/J RIJCOSX
keywords: DEFGRID2
keywords: scfconv7
keywords: smallprint printgap noloewdin
keywords: NOSOSCF
formula: C18H35NO2
InChI: InChI=1/C18H35NO2/c1-6-12-19(7-2)13-16-14-20-18(21-16)10-8-15(9-11-18)17(3,4)5/h15-16H,6-14H2,1-5H3
56 atoms
O  -0.436163 0.866795 0.373304
O  -0.195756 3.064447 0.075448
N  -3.219493 -0.595447 0.577991
C  3.048949 0.281548 -0.157059
C  0.527216 1.850076 0.076991
C  1.990294 0.295483 -1.263672
C  2.384407 0.569711 1.192703
C  3.92835 -0.996354 -0.156817
C  1.187484 1.592736 -1.274043
C  1.5718 1.862389 1.174997
C  -1.649522 1.25086 -0.253106
C  -1.526711 2.783183 -0.321172
C  4.65967 -1.118454 -1.496972
C  4.99135 -0.892218 0.940898
C  3.108228 -2.267269 0.072963
C  -2.858898 0.809707 0.562261
C  -3.590495 -1.089448 -0.741682
C  -2.256699 -1.481334 1.221235
C  -4.573507 -2.252779 -0.711099
C  -1.932778 -1.124938 2.66021
C  -4.924056 -2.724848 -2.113906
H  3.732974 1.119096 -0.359698
H  2.456907 0.17274 -2.24223
H  1.30787 -0.551164 -1.144277
H  1.736799 -0.263915 1.480661
H  3.135306 0.655201 1.979197
H  0.44047 1.567777 -2.073327
H  1.852257 2.433287 -1.49473
H  2.240118 2.711415 1.006144
H  1.08705 2.021422 2.142081
H  -1.702254 0.830005 -1.264404
H  -2.211871 3.281558 0.370946
H  -1.734051 3.156069 -1.327532
H  5.22408 -0.210804 -1.72521
H  5.369699 -1.948092 -1.471859
H  3.980703 -1.304172 -2.33002
H  5.562249 0.035733 0.855121
H  5.699599 -1.720642 0.868614
H  4.562644 -0.926212 1.94323
H  2.373868 -2.433557 -0.717099
H  3.762691 -3.14179 0.091579
H  2.572626 -2.247205 1.023773
H  -3.717714 1.358829 0.164972
H  -2.730804 1.167666 1.587694
H  -4.058779 -0.269654 -1.293086
H  -2.706753 -1.383782 -1.330892
H  -2.6874 -2.484228 1.220387
H  -1.322837 -1.566707 0.646037
H  -5.481724 -1.941456 -0.189221
H  -4.163007 -3.091921 -0.144236
H  -1.384985 -0.18809 2.755605
H  -2.83514 -1.051869 3.268448
H  -1.307897 -1.907093 3.092721
H  -5.359489 -1.919466 -2.708514
H  -5.647198 -3.540563 -2.088304
H  -4.042135 -3.085591 -2.646274
elementType: O N C H
totalener: -912.30374858 hartree
nucrepener: 1916.53206708 hartree
electener: -2828.83581566 hartree
oneelecener: -5046.59044867 hartree
twoeener: 2217.75463301 hartree
cpcmener: -0.02016922 hartree
kineticenergy: 907.80717326 hartree
xcener: -92.074651449025 hartree
chargesum: 0.0000000
charge: -0.396230 -0.414294 -0.214798 0.097267 0.554089 -0.253996 -0.230000 0.262231 -0.276199 -0.244947 0.140223 0.023660 -0.362873 -0.362737 -0.378288 -0.180615 -0.080322 -0.073508 -0.067960 -0.271408 -0.285283 0.058324 0.089565 0.080076 0.080183 0.088758 0.090398 0.087074 0.088566 0.080656 0.096762 0.082912 0.087414 0.098533 0.096029 0.095221 0.099023 0.095697 0.095241 0.095552 0.099033 0.096887 0.105177 0.104655 0.089922 0.068848 0.095839 0.059392 0.046742 0.057790 0.072265 0.085535 0.095418 0.080459 0.091647 0.080393
qa: -0.3962 -0.4143 -0.2148 0.0973 0.5541 -0.2540 -0.2300 0.2622 -0.2762 -0.2449 0.1402 0.0237 -0.3629 -0.3627 -0.3783 -0.1806 -0.0803 -0.0735 -0.0680 -0.2714 -0.2853 0.0583 0.0896 0.0801 0.0802 0.0888 0.0904 0.0871 0.0886 0.0807 0.0968 0.0829 0.0874 0.0985 0.0960 0.0952 0.0990 0.0957 0.0952 0.0956 0.0990 0.0969 0.1052 0.1047 0.0899 0.0688 0.0958 0.0594 0.0467 0.0578 0.0723 0.0855 0.0954 0.0805 0.0916 0.0804
va: 1.9741 1.9867 2.8975 3.6730 3.7997 3.9684 3.9480 3.6734 4.0224 3.9866 3.7371 3.9711 3.9212 3.9221 3.9453 4.0379 3.9167 3.9223 3.8540 3.8962 3.9545 1.0171 1.0127 1.0127 1.0081 1.0130 1.0076 1.0223 1.0175 1.0310 0.9963 0.9957 0.9952 1.0028 1.0062 0.9996 1.0026 1.0070 0.9980 1.0000 1.0045 1.0008 0.9993 0.9968 0.9949 0.9974 0.9877 1.0082 1.0206 1.0137 1.0143 1.0127 1.0048 1.0008 1.0042 1.0007
dispcorr: -0.029184407 hartree
energy: -912.332932990103
dipole: 3.96171 -3.99536 -0.03365 -16.23410 16.02884 -0.20526 -2.59666 1.70905 -0.88761
magnitude: 0.91166 au
magnitude: 2.31725 debye
