program: Orca
programVersion: 5.0.2
elementType: O O N C C C C C C C C C C C C C C C C C C H H H H H H H H H H H H H H H H H H H H H H H H H H H H H H H H H H H
charge: 0
multiplicity: 1
keywords: wb97x-d3
keywords: def2-TZVPP
keywords: def2/J RIJCOSX
keywords: DEFGRID2
keywords: scfconv7
keywords: smallprint printgap noloewdin
keywords: NOSOSCF
formula: C18H35NO2
InChI: InChI=1/C18H35NO2/c1-6-12-19(7-2)13-16-14-20-18(21-16)10-8-15(9-11-18)17(3,4)5/h15-16H,6-14H2,1-5H3
56 atoms
O  -0.264963 0.748886 0.363734
O  0.004757 2.961872 0.700738
N  -3.093991 -0.543362 -0.396136
C  3.257091 0.357374 -0.263446
C  0.708416 1.768181 0.37977
C  2.202958 0.669792 -1.330468
C  2.565779 0.21557 1.096037
C  4.179384 -0.836535 -0.626853
C  1.382977 1.907809 -0.980361
C  1.739187 1.449546 1.447817
C  -1.505521 1.346639 0.017328
C  -1.384447 2.689585 0.720817
C  4.950937 -0.518399 -1.911124
C  5.209807 -1.056863 0.485509
C  3.39728 -2.135148 -0.830224
C  -2.688983 0.528507 0.496999
C  -4.463515 -0.964815 -0.129427
C  -2.135552 -1.643524 -0.399197
C  -4.742465 -1.667851 1.197714
C  -2.50306 -2.783727 -1.330802
C  -6.221041 -1.998115 1.337339
H  3.915238 1.236443 -0.195595
H  2.671522 0.832406 -2.302283
H  1.532717 -0.186135 -1.455387
H  1.923193 -0.670211 1.100953
H  3.30001 0.064483 1.888602
H  0.634951 2.099709 -1.755291
H  2.038308 2.783679 -0.952504
H  2.403274 2.313047 1.547049
H  1.241314 1.315671 2.41204
H  -1.576453 1.492165 -1.06808
H  -1.7537 2.630771 1.75218
H  -1.930877 3.480889 0.205257
H  5.503945 0.419778 -1.818952
H  5.676216 -1.305836 -2.127709
H  4.300118 -0.435768 -2.782426
H  5.744814 -0.134108 0.724045
H  5.952289 -1.795518 0.17567
H  4.758528 -1.426305 1.407184
H  4.080726 -2.958177 -1.051505
H  2.832251 -2.418209 0.059818
H  2.694163 -2.069371 -1.662208
H  -3.530947 1.222127 0.575402
H  -2.476935 0.18773 1.522924
H  -5.096938 -0.074926 -0.194528
H  -4.793289 -1.613107 -0.945597
H  -1.172327 -1.251298 -0.725814
H  -1.96846 -2.045886 0.612193
H  -4.429198 -1.037611 2.034551
H  -4.156636 -2.588352 1.269403
H  -3.387852 -3.331945 -1.00619
H  -2.676206 -2.431806 -2.348651
H  -1.678788 -3.496865 -1.366097
H  -6.433088 -2.50051 2.281511
H  -6.558568 -2.655443 0.533511
H  -6.834437 -1.095674 1.300236
elementType: O N C H
totalener: -912.30465004 hartree
nucrepener: 1889.23331999 hartree
electener: -2801.53797002 hartree
oneelecener: -4992.07291286 hartree
twoeener: 2190.53494284 hartree
cpcmener: -0.01946932 hartree
kineticenergy: 907.80269428 hartree
xcener: -92.073040447436 hartree
chargesum: -0.0000000
charge: -0.413801 -0.428574 -0.211236 0.091505 0.595093 -0.248732 -0.228996 0.265487 -0.271316 -0.262402 0.144957 0.026649 -0.362071 -0.362324 -0.378689 -0.118387 -0.119021 -0.075550 -0.085893 -0.273245 -0.281846 0.058076 0.089497 0.081461 0.079503 0.088430 0.089199 0.087486 0.082875 0.082636 0.056435 0.077885 0.094623 0.098011 0.095556 0.095026 0.099981 0.095142 0.094025 0.098963 0.098058 0.095848 0.104508 0.070672 0.091370 0.092728 0.079264 0.072614 0.069720 0.062104 0.085113 0.081444 0.095836 0.092293 0.081180 0.080830
qa: -0.4138 -0.4286 -0.2112 0.0915 0.5951 -0.2487 -0.2290 0.2655 -0.2713 -0.2624 0.1450 0.0266 -0.3621 -0.3623 -0.3787 -0.1184 -0.1190 -0.0756 -0.0859 -0.2732 -0.2818 0.0581 0.0895 0.0815 0.0795 0.0884 0.0892 0.0875 0.0829 0.0826 0.0564 0.0779 0.0946 0.0980 0.0956 0.0950 0.1000 0.0951 0.0940 0.0990 0.0981 0.0958 0.1045 0.0707 0.0914 0.0927 0.0793 0.0726 0.0697 0.0621 0.0851 0.0814 0.0958 0.0923 0.0812 0.0808
va: 1.9764 1.9720 2.9165 3.6788 3.7154 3.9604 3.9259 3.6676 4.0418 4.0494 3.9107 3.9928 3.9214 3.9239 3.9448 3.9259 3.9672 3.9217 3.8091 3.9176 3.9517 1.0169 1.0151 1.0062 1.0159 1.0118 1.0114 1.0203 1.0184 1.0251 1.0290 0.9970 0.9944 1.0029 1.0061 1.0003 1.0022 1.0071 0.9979 1.0043 1.0006 0.9997 0.9954 1.0200 1.0006 0.9908 1.0047 0.9961 1.0093 1.0064 0.9975 1.0097 1.0048 1.0021 1.0015 1.0012
dispcorr: -0.028393387 hartree
energy: -912.333043424788
dipole: 0.60561 -1.07846 -0.47284 -16.54373 16.26946 -0.27427 -2.37705 2.45999 0.08294
magnitude: 0.55289 au
magnitude: 1.40532 debye
