program: Orca
programVersion: 5.0.2
elementType: O O N C C C C C C C C C C C C C C C C C C H H H H H H H H H H H H H H H H H H H H H H H H H H H H H H H H H H H
charge: 0
multiplicity: 1
keywords: wb97x-d3
keywords: def2-TZVPP
keywords: def2/J RIJCOSX
keywords: DEFGRID2
keywords: scfconv7
keywords: smallprint printgap noloewdin
keywords: NOSOSCF
formula: C18H35NO2
InChI: InChI=1/C18H35NO2/c1-6-12-19(7-2)13-16-14-20-18(21-16)10-8-15(9-11-18)17(3,4)5/h15-16H,6-14H2,1-5H3
56 atoms
O  -0.484717 1.147803 -0.455041
O  -0.083681 3.106585 0.552783
N  -3.230586 -0.47499 -0.109589
C  2.87644 0.043736 0.1793
C  0.521242 1.874804 0.228477
C  2.397627 0.800773 -1.062949
C  1.690015 -0.179455 1.120583
C  3.666172 -1.251221 -0.145552
C  1.695431 2.108014 -0.703799
C  0.982924 1.124759 1.47525
C  -1.768178 1.632181 -0.071204
C  -1.439484 2.824835 0.835231
C  4.142163 -1.906613 1.154149
C  2.82591 -2.264472 -0.925804
C  4.909797 -0.904869 -0.969744
C  -2.626815 0.599729 0.656286
C  -2.291889 -1.456689 -0.637163
C  -4.143269 0.011308 -1.136014
C  -1.609221 -2.312685 0.420807
C  -5.246417 -0.97697 -1.475044
C  -2.553854 -3.236466 1.172559
H  3.58168 0.704506 0.704963
H  3.236365 1.035132 -1.720205
H  1.718723 0.172645 -1.647114
H  0.974134 -0.86709 0.662001
H  2.015096 -0.652918 2.048019
H  1.353148 2.619323 -1.607389
H  2.404736 2.775245 -0.205352
H  1.67118 1.772775 2.02668
H  0.138085 0.922563 2.139994
H  -2.280039 1.974333 -0.976861
H  -1.586962 2.577218 1.894088
H  -2.0410 3.704811 0.6086
H  4.812856 -2.741258 0.938161
H  4.690222 -1.198398 1.780656
H  3.31811 -2.304985 1.747399
H  3.403656 -3.172926 -1.111374
H  2.512618 -1.87982 -1.897821
H  1.926594 -2.561941 -0.382313
H  5.52377 -0.154005 -0.466106
H  5.530155 -1.791717 -1.116115
H  4.663571 -0.521115 -1.960487
H  -3.441522 1.157217 1.131273
H  -2.042167 0.178837 1.479258
H  -2.849792 -2.131559 -1.290106
H  -1.529433 -0.997493 -1.281038
H  -4.609103 0.927847 -0.766444
H  -3.614206 0.292678 -2.059169
H  -1.05998 -1.689172 1.130256
H  -0.850157 -2.91136 -0.090638
H  -5.857173 -1.200617 -0.599934
H  -5.900652 -0.556726 -2.239786
H  -4.860832 -1.919383 -1.865172
H  -2.006685 -3.889332 1.85342
H  -3.109327 -3.87574 0.4835
H  -3.280681 -2.685451 1.768547
elementType: O N C H
totalener: -912.30135288 hartree
nucrepener: 1946.34737102 hartree
electener: -2858.64872389 hartree
oneelecener: -5106.24173083 hartree
twoeener: 2247.59300694 hartree
cpcmener: -0.02038536 hartree
kineticenergy: 907.80020614 hartree
xcener: -92.075162150210 hartree
chargesum: -0.0000000
charge: -0.419473 -0.403687 -0.225524 0.101663 0.575216 -0.220127 -0.220349 0.271125 -0.274482 -0.287898 0.193732 -0.019902 -0.365995 -0.380209 -0.359363 -0.204698 -0.117039 -0.043207 -0.085462 -0.273063 -0.287892 0.057735 0.090084 0.077125 0.031615 0.093353 0.080049 0.085623 0.088327 0.097227 0.101211 0.083247 0.106955 0.095706 0.099328 0.095191 0.099790 0.097288 0.092401 0.098961 0.095217 0.094960 0.102591 0.110937 0.106462 0.089842 0.085420 0.069081 0.056521 0.072407 0.072442 0.090218 0.079974 0.094779 0.080557 0.074009
qa: -0.4195 -0.4037 -0.2255 0.1017 0.5752 -0.2201 -0.2203 0.2711 -0.2745 -0.2879 0.1937 -0.0199 -0.3660 -0.3802 -0.3594 -0.2047 -0.1170 -0.0432 -0.0855 -0.2731 -0.2879 0.0577 0.0901 0.0771 0.0316 0.0934 0.0800 0.0856 0.0883 0.0972 0.1012 0.0832 0.1070 0.0957 0.0993 0.0952 0.0998 0.0973 0.0924 0.0990 0.0952 0.0950 0.1026 0.1109 0.1065 0.0898 0.0854 0.0691 0.0565 0.0724 0.0724 0.0902 0.0800 0.0948 0.0806 0.0740
va: 1.9506 1.9969 2.8255 3.6951 3.7464 3.9157 3.9938 3.6657 4.0521 4.0060 3.7221 3.9880 3.9235 3.9535 3.9187 4.0671 3.8908 3.8782 3.8192 3.9373 3.9454 1.0175 1.0136 1.0185 1.0330 1.0124 1.0306 1.0161 1.0237 1.0124 0.9981 0.9984 0.9957 1.0068 1.0024 0.9978 1.0054 0.9997 0.9982 1.0027 1.0064 1.0003 0.9999 0.9878 0.9873 1.0201 0.9919 0.9957 1.0062 1.0127 1.0119 1.0085 1.0038 1.0049 1.0017 1.0138
dispcorr: -0.031024993 hartree
energy: -912.332377868344
dipole: 2.74451 -2.95688 -0.21237 -17.73765 17.75390 0.01625 -0.88850 1.12910 0.24060
magnitude: 0.32133 au
magnitude: 0.81677 debye
