program: Orca
programVersion: 5.0.2
elementType: O O N C C C C C C C C C C C C C C C C C C H H H H H H H H H H H H H H H H H H H H H H H H H H H H H H H H H H H
charge: 0
multiplicity: 1
keywords: wb97x-d3
keywords: def2-TZVPP
keywords: def2/J RIJCOSX
keywords: DEFGRID2
keywords: scfconv7
keywords: smallprint printgap noloewdin
keywords: NOSOSCF
formula: C18H35NO2
InChI: InChI=1/C18H35NO2/c1-6-12-19(7-2)13-16-14-20-18(21-16)10-8-15(9-11-18)17(3,4)5/h15-16H,6-14H2,1-5H3
56 atoms
O  -0.435693 0.625829 0.403975
O  -0.272167 2.84206 -0.019711
N  -3.278883 -0.904125 0.677805
C  3.087651 0.196719 -0.050984
C  0.486167 1.64601 0.081343
C  2.043523 0.105552 -1.16897
C  2.385434 0.494477 1.277266
C  4.042829 -1.024004 0.01424
C  1.170048 1.35543 -1.246856
C  1.51596 1.745828 1.194702
C  -1.745821 1.072354 0.083659
C  -1.615881 2.564935 0.324446
C  3.309958 -2.314802 0.385872
C  4.729802 -1.2217 -1.340416
C  5.139207 -0.767029 1.052159
C  -2.786991 0.42163 0.991311
C  -4.362324 -0.943598 -0.289308
C  -2.262544 -1.919398 0.454451
C  -4.071467 -0.599909 -1.751015
C  -1.451297 -2.253544 1.69562
C  -5.28353 -0.889107 -2.624968
H  3.722459 1.065577 -0.280194
H  2.528063 -0.03049 -2.136829
H  1.408247 -0.772933 -1.02009
H  1.769057 -0.358353 1.577168
H  3.114275 0.636388 2.076735
H  0.419635 1.246082 -2.035522
H  1.789153 2.216959 -1.515412
H  2.149307 2.615716 0.997541
H  1.011089 1.92564 2.148087
H  -1.961453 0.877864 -0.973047
H  -1.817121 2.816482 1.37407
H  -2.285434 3.153811 -0.303776
H  2.50683 -2.549734 -0.314901
H  4.002564 -3.159593 0.376477
H  2.874852 -2.269239 1.385717
H  5.214736 -0.302911 -1.679856
H  4.035633 -1.538424 -2.119694
H  5.501245 -1.991622 -1.268345
H  4.74791 -0.702133 2.068137
H  5.871004 -1.577873 1.04311
H  5.676093 0.161787 0.843456
H  -3.654976 1.086448 1.019041
H  -2.376577 0.436225 2.006985
H  -4.784846 -1.953525 -0.258214
H  -5.155368 -0.279407 0.069029
H  -2.780467 -2.827406 0.136026
H  -1.578317 -1.669699 -0.368602
H  -3.213167 -1.172731 -2.113025
H  -3.805887 0.455521 -1.847422
H  -2.088735 -2.630875 2.496055
H  -0.721475 -3.029082 1.459151
H  -0.896862 -1.399924 2.084597
H  -5.543815 -1.949143 -2.604936
H  -5.103069 -0.614409 -3.664611
H  -6.158712 -0.330765 -2.286392
elementType: O N C H
totalener: -912.30152434 hartree
nucrepener: 1924.43427728 hartree
electener: -2836.73580162 hartree
oneelecener: -5062.38971585 hartree
twoeener: 2225.65391423 hartree
cpcmener: -0.01931007 hartree
kineticenergy: 907.80359634 hartree
xcener: -92.075349086725 hartree
chargesum: 0.0000000
charge: -0.406996 -0.424123 -0.234785 0.092823 0.592390 -0.239143 -0.238792 0.268137 -0.277399 -0.258655 0.108315 0.037033 -0.381738 -0.362685 -0.363207 -0.156958 -0.072282 -0.049169 -0.090429 -0.278594 -0.289396 0.059236 0.086939 0.078944 0.078560 0.090676 0.084433 0.086678 0.081926 0.082910 0.094591 0.076081 0.097397 0.098354 0.099307 0.094684 0.099829 0.094796 0.095644 0.095485 0.096001 0.098316 0.105448 0.103249 0.080265 0.082119 0.091613 0.062770 0.070407 0.056371 0.082886 0.090674 0.074382 0.081699 0.092457 0.080523
qa: -0.4070 -0.4241 -0.2348 0.0928 0.5924 -0.2391 -0.2388 0.2681 -0.2774 -0.2587 0.1083 0.0370 -0.3817 -0.3627 -0.3632 -0.1570 -0.0723 -0.0492 -0.0904 -0.2786 -0.2894 0.0592 0.0869 0.0789 0.0786 0.0907 0.0844 0.0867 0.0819 0.0829 0.0946 0.0761 0.0974 0.0984 0.0993 0.0947 0.0998 0.0948 0.0956 0.0955 0.0960 0.0983 0.1054 0.1032 0.0803 0.0821 0.0916 0.0628 0.0704 0.0564 0.0829 0.0907 0.0744 0.0817 0.0925 0.0805
va: 1.9683 1.9808 2.9237 3.6745 3.7357 3.9493 3.9521 3.6660 4.0327 4.0373 3.8207 3.9878 3.9471 3.9209 3.9217 3.9910 3.9312 3.8821 3.7990 3.9125 3.9618 1.0165 1.0147 1.0112 1.0050 1.0134 1.0158 1.0184 1.0201 1.0217 0.9976 0.9970 0.9945 1.0002 1.0054 0.9994 1.0023 0.9978 1.0070 0.9996 1.0060 1.0029 1.0011 1.0020 0.9969 1.0029 0.9936 0.9972 1.0052 1.0120 1.0139 1.0064 1.0115 1.0019 1.0017 1.0006
dispcorr: -0.030066779 hartree
energy: -912.331591116488
dipole: 4.20107 -4.52804 -0.32697 -13.51139 13.49927 -0.01212 -3.50219 3.00172 -0.50047
magnitude: 0.59794 au
magnitude: 1.51984 debye
