program: Orca
programVersion: 5.0.2
elementType: O O N C C C C C C C C C C C C C C C C C C H H H H H H H H H H H H H H H H H H H H H H H H H H H H H H H H H H H
charge: 0
multiplicity: 1
keywords: wb97x-d3
keywords: def2-TZVPP
keywords: def2/J RIJCOSX
keywords: DEFGRID2
keywords: scfconv7
keywords: smallprint printgap noloewdin
keywords: NOSOSCF
formula: C18H35NO2
InChI: InChI=1/C18H35NO2/c1-6-12-19(7-2)13-16-14-20-18(21-16)10-8-15(9-11-18)17(3,4)5/h15-16H,6-14H2,1-5H3
56 atoms
O  -0.372131 1.024715 -0.365321
O  -0.032251 3.109042 0.400099
N  -3.153824 -0.504148 0.011736
C  3.103578 0.229618 -0.002637
C  0.631898 1.894183 0.134271
C  2.450543 0.833827 -1.24918
C  2.040722 0.021938 1.08097
C  3.946147 -1.039858 -0.297529
C  1.686438 2.115743 -0.9332
C  1.268721 1.302749 1.388681
C  -1.662679 1.522501 -0.032107
C  -1.350369 2.778533 0.782211
C  3.085853 -2.211053 -0.777219
C  4.993285 -0.730627 -1.371675
C  4.697052 -1.468673 0.967025
C  -2.508021 0.550787 0.770143
C  -4.134951 -1.172695 0.856872
C  -2.229692 -1.431548 -0.630984
C  -4.966047 -2.238659 0.157989
C  -1.353072 -2.283523 0.281597
C  -5.693064 -1.754143 -1.086811
H  3.810605 0.980442 0.380321
H  3.204311 1.068835 -2.001725
H  1.774269 0.108401 -1.711444
H  1.3377 -0.757069 0.772641
H  2.499339 -0.331775 2.005716
H  1.216474 2.512391 -1.836951
H  2.387039 2.875878 -0.574639
H  1.951352 2.04767 1.809007
H  0.506022 1.105225 2.147856
H  -2.186091 1.785156 -0.95781
H  -1.421981 2.586144 1.860353
H  -2.012018 3.610386 0.541983
H  3.715232 -3.073749 -1.007959
H  2.367489 -2.53289 -0.021238
H  2.527321 -1.9702 -1.683684
H  5.584497 0.151358 -1.112576
H  4.547295 -0.554847 -2.351291
H  5.685402 -1.568398 -1.481051
H  5.36952 -2.301243 0.748783
H  5.303941 -0.651837 1.365442
H  4.026618 -1.8008 1.760671
H  -3.306384 1.14755 1.223676
H  -1.903869 0.177228 1.613682
H  -3.671887 -1.621122 1.750612
H  -4.816382 -0.403475 1.233159
H  -2.81018 -2.094429 -1.276046
H  -1.596034 -0.867012 -1.314896
H  -5.697789 -2.592239 0.888894
H  -4.353004 -3.110606 -0.085392
H  -0.662263 -2.874865 -0.321671
H  -0.751475 -1.683432 0.965134
H  -1.938271 -2.980811 0.883127
H  -5.004802 -1.512482 -1.89696
H  -6.283415 -0.859648 -0.878003
H  -6.375974 -2.517418 -1.461546
elementType: O N C H
totalener: -912.30308282 hartree
nucrepener: 1924.52863231 hartree
electener: -2836.83171513 hartree
oneelecener: -5062.68198593 hartree
twoeener: 2225.85027080 hartree
cpcmener: -0.01958765 hartree
kineticenergy: 907.80086169 hartree
xcener: -92.076268711897 hartree
chargesum: -0.0000000
charge: -0.420112 -0.404790 -0.188727 0.101127 0.574087 -0.218465 -0.234198 0.271587 -0.278958 -0.281177 0.250205 -0.027075 -0.385562 -0.361181 -0.365692 -0.223880 -0.112921 -0.070109 -0.094581 -0.313064 -0.283084 0.058213 0.088991 0.077503 0.052975 0.090656 0.080422 0.084818 0.086606 0.093567 0.074162 0.085506 0.110381 0.100881 0.091930 0.100219 0.099676 0.094804 0.095586 0.095570 0.098840 0.096044 0.103600 0.082433 0.086506 0.092504 0.085878 0.082838 0.074206 0.061723 0.098573 0.091666 0.099143 0.075189 0.080695 0.094267
qa: -0.4201 -0.4048 -0.1887 0.1011 0.5741 -0.2185 -0.2342 0.2716 -0.2790 -0.2812 0.2502 -0.0271 -0.3856 -0.3612 -0.3657 -0.2239 -0.1129 -0.0701 -0.0946 -0.3131 -0.2831 0.0582 0.0890 0.0775 0.0530 0.0907 0.0804 0.0848 0.0866 0.0936 0.0742 0.0855 0.1104 0.1009 0.0919 0.1002 0.0997 0.0948 0.0956 0.0956 0.0988 0.0960 0.1036 0.0824 0.0865 0.0925 0.0859 0.0828 0.0742 0.0617 0.0986 0.0917 0.0991 0.0752 0.0807 0.0943
va: 1.9578 1.9922 2.8929 3.6818 3.7428 3.9141 3.9888 3.6650 4.0610 4.0209 3.7341 3.9959 3.9488 3.9209 3.9216 4.0046 3.9189 3.9265 3.8474 3.9041 3.9486 1.0173 1.0129 1.0177 1.0172 1.0160 1.0279 1.0163 1.0225 1.0120 1.0179 0.9999 0.9945 1.0060 0.9990 0.9997 1.0023 0.9976 1.0070 1.0065 1.0025 0.9994 1.0017 0.9939 0.9990 0.9984 0.9924 1.0200 1.0074 1.0043 1.0092 0.9917 0.9997 1.0046 1.0012 1.0048
dispcorr: -0.030503904 hartree
energy: -912.333586725118
dipole: 2.75475 -2.97155 -0.21680 -17.67904 17.28167 -0.39737 -0.14975 0.97811 0.82836
magnitude: 0.94397 au
magnitude: 2.39938 debye
