program: Orca
programVersion: 5.0.2
elementType: O O N C C C C C C C C C C C C C C C C C C H H H H H H H H H H H H H H H H H H H H H H H H H H H H H H H H H H H
charge: 0
multiplicity: 1
keywords: wb97x-d3
keywords: def2-TZVPP
keywords: def2/J RIJCOSX
keywords: DEFGRID2
keywords: scfconv7
keywords: smallprint printgap noloewdin
keywords: NOSOSCF
formula: C18H35NO2
InChI: InChI=1/C18H35NO2/c1-6-12-19(7-2)13-16-14-20-18(21-16)10-8-15(9-11-18)17(3,4)5/h15-16H,6-14H2,1-5H3
56 atoms
O  -0.391669 0.740896 -0.346471
O  -0.289931 2.831453 0.461403
N  -3.006337 -1.147303 0.047101
C  3.133067 0.298587 -0.05334
C  0.512269 1.712194 0.156613
C  2.389513 0.856196 -1.271861
C  2.136465 0.001083 1.071468
C  4.058131 -0.901462 -0.390438
C  1.518116 2.060693 -0.923091
C  1.24272 1.194245 1.392902
C  -1.721359 1.063928 0.052822
C  -1.528449 2.314793 0.907558
C  3.278521 -2.104652 -0.926158
C  5.091021 -0.48098 -1.440344
C  4.824841 -1.335615 0.863061
C  -2.404648 -0.069729 0.816895
C  -4.1635 -0.710051 -0.725961
C  -2.067907 -1.874568 -0.79838
C  -5.377973 -0.303303 0.099367
C  -0.963699 -2.585714 -0.038536
C  -5.983983 -1.436339 0.91407
H  3.794247 1.099629 0.309163
H  3.098189 1.162688 -2.042545
H  1.766596 0.078404 -1.722676
H  1.511867 -0.855408 0.80493
H  2.664402 -0.282309 1.983362
H  0.996073 2.423952 -1.812226
H  2.150818 2.877365 -0.562925
H  1.854583 2.010954 1.788462
H  0.530583 0.923906 2.177874
H  -2.292372 1.315459 -0.847845
H  -1.503385 2.073535 1.978214
H  -2.307023 3.0601 0.746198
H  3.959962 -2.930864 -1.141507
H  2.543808 -2.47587 -0.208978
H  2.749209 -1.876575 -1.852986
H  5.634563 0.414486 -1.129005
H  4.640162 -0.273757 -2.411482
H  5.826458 -1.27403 -1.59245
H  4.173768 -1.767757 1.624104
H  5.567542 -2.09571 0.610716
H  5.355984 -0.495741 1.317874
H  -3.189197 0.376364 1.433693
H  -1.686245 -0.48475 1.529913
H  -3.914622 0.108534 -1.418862
H  -4.461645 -1.547805 -1.36251
H  -2.643026 -2.631941 -1.336415
H  -1.624429 -1.237569 -1.578416
H  -6.12544 0.069134 -0.60598
H  -5.146799 0.544096 0.750166
H  -1.371887 -3.29002 0.687139
H  -0.347539 -3.150959 -0.738761
H  -0.301783 -1.904345 0.493307
H  -6.893995 -1.112334 1.420858
H  -5.30316 -1.805297 1.680116
H  -6.24933 -2.28095 0.274198
elementType: O N C H
totalener: -912.30149329 hartree
nucrepener: 1929.84551696 hartree
electener: -2842.14701025 hartree
oneelecener: -5073.26515468 hartree
twoeener: 2231.11814443 hartree
cpcmener: -0.02043830 hartree
kineticenergy: 907.78676341 hartree
xcener: -92.073301990251 hartree
chargesum: 0.0000000
charge: -0.417051 -0.404789 -0.217847 0.105345 0.568050 -0.220981 -0.257104 0.269078 -0.270135 -0.273761 0.189118 -0.022086 -0.388178 -0.359931 -0.364282 -0.232385 -0.088669 -0.053555 -0.099803 -0.277530 -0.276470 0.058954 0.090649 0.076995 0.074448 0.090668 0.079573 0.084744 0.087179 0.091449 0.097398 0.083808 0.111008 0.101682 0.091315 0.099291 0.099283 0.094881 0.095320 0.095562 0.095431 0.098947 0.116495 0.118879 0.089406 0.089613 0.087693 0.062024 0.071758 0.063513 0.088017 0.094554 0.067926 0.093266 0.073069 0.078168
qa: -0.4171 -0.4048 -0.2178 0.1053 0.5680 -0.2210 -0.2571 0.2691 -0.2701 -0.2738 0.1891 -0.0221 -0.3882 -0.3599 -0.3643 -0.2324 -0.0887 -0.0536 -0.0998 -0.2775 -0.2765 0.0590 0.0906 0.0770 0.0744 0.0907 0.0796 0.0847 0.0872 0.0914 0.0974 0.0838 0.1110 0.1017 0.0913 0.0993 0.0993 0.0949 0.0953 0.0956 0.0954 0.0989 0.1165 0.1189 0.0894 0.0896 0.0877 0.0620 0.0718 0.0635 0.0880 0.0946 0.0679 0.0933 0.0731 0.0782
va: 1.9441 1.9994 2.8739 3.6756 3.7680 3.9155 3.9992 3.6674 4.0480 4.0162 3.7307 4.0010 3.9518 3.9184 3.9219 4.0411 3.9003 3.8806 3.8428 3.9158 3.9357 1.0170 1.0121 1.0197 0.9974 1.0155 1.0285 1.0161 1.0216 1.0114 1.0059 0.9997 0.9954 1.0061 1.0004 0.9988 1.0026 0.9988 1.0069 0.9977 1.0069 1.0026 0.9920 0.9921 1.0090 0.9965 0.9969 1.0053 1.0104 1.0064 1.0146 1.0056 0.9956 1.0055 1.0138 1.0014
dispcorr: -0.030731959 hartree
energy: -912.332225246755
dipole: 3.41643 -3.69694 -0.28051 -14.03622 14.12814 0.09192 -0.50925 0.72051 0.21125
magnitude: 0.36299 au
magnitude: 0.92265 debye
