program: Orca
programVersion: 5.0.2
elementType: O O N C C C C C C C C C C C C C C C C C C H H H H H H H H H H H H H H H H H H H H H H H H H H H H H H H H H H H
charge: 0
multiplicity: 1
keywords: wb97x-d3
keywords: def2-TZVPP
keywords: def2/J RIJCOSX
keywords: DEFGRID2
keywords: scfconv7
keywords: smallprint printgap noloewdin
keywords: NOSOSCF
formula: C18H35NO2
InChI: InChI=1/C18H35NO2/c1-6-12-19(7-2)13-16-14-20-18(21-16)10-8-15(9-11-18)17(3,4)5/h15-16H,6-14H2,1-5H3
56 atoms
O  -0.386066 0.91268 -0.454602
O  -0.122841 3.035721 0.198545
N  -2.720032 -0.971381 0.602853
C  3.146305 0.31088 -0.176883
C  0.594422 1.844858 -0.037188
C  2.417022 0.800938 -1.432241
C  2.127645 0.101077 0.947563
C  4.065726 -0.915138 -0.418026
C  1.590929 2.056117 -1.160607
C  1.314711 1.361811 1.220354
C  -1.650494 1.286083 0.083359
C  -1.374792 2.649728 0.728747
C  5.011213 -0.640199 -1.591187
C  4.930887 -1.157946 0.822459
C  3.26775 -2.185408 -0.718867
C  -2.199038 0.284362 1.095353
C  -3.968942 -0.831589 -0.139204
C  -1.744062 -1.839663 -0.03294
C  -5.184328 -1.328232 0.632163
C  -2.180944 -3.294181 -0.049417
C  -6.474122 -1.146889 -0.151881
H  3.810565 1.128967 0.139242
H  3.130902 1.036058 -2.222572
H  1.771535 0.011117 -1.829064
H  1.447688 -0.717161 0.691058
H  2.626066 -0.195951 1.871807
H  1.064907 2.371373 -2.065639
H  2.260613 2.873084 -0.876299
H  1.981918 2.160699 1.558398
H  0.604111 1.180533 2.031341
H  -2.347158 1.391589 -0.755178
H  -1.342528 2.575723 1.82293
H  -2.120563 3.399182 0.464531
H  4.490418 -0.606009 -2.548974
H  5.540107 0.308107 -1.465751
H  5.76492 -1.427298 -1.664983
H  5.518811 -0.271614 1.074182
H  5.632128 -1.977021 0.647956
H  4.341518 -1.424077 1.700804
H  3.944423 -3.011888 -0.948155
H  2.655839 -2.499466 0.12824
H  2.606138 -2.063121 -1.578766
H  -3.00675 0.786731 1.638274
H  -1.421685 0.083894 1.840292
H  -4.139926 0.214315 -0.419778
H  -3.905311 -1.37078 -1.090005
H  -1.510892 -1.531287 -1.062947
H  -0.808866 -1.764978 0.527693
H  -5.253114 -0.791389 1.582732
H  -5.04628 -2.383735 0.882685
H  -2.337005 -3.675531 0.960351
H  -3.104915 -3.44081 -0.611131
H  -1.415201 -3.908989 -0.524471
H  -6.44466 -1.691416 -1.097949
H  -6.654424 -0.095809 -0.385535
H  -7.336883 -1.510144 0.407294
elementType: O N C H
totalener: -912.30156749 hartree
nucrepener: 1907.74386764 hartree
electener: -2820.04543513 hartree
oneelecener: -5028.97178818 hartree
twoeener: 2208.92635305 hartree
cpcmener: -0.02076476 hartree
kineticenergy: 907.80458412 hartree
xcener: -92.072971072022 hartree
chargesum: -0.0000000
charge: -0.424117 -0.404270 -0.244554 0.090906 0.565394 -0.213025 -0.249455 0.272026 -0.269007 -0.278355 0.196959 -0.016291 -0.359721 -0.362656 -0.382349 -0.187491 -0.063180 -0.038662 -0.072447 -0.279709 -0.284732 0.057269 0.087616 0.076181 0.067901 0.090513 0.079628 0.085390 0.087909 0.094491 0.096915 0.082985 0.106347 0.093925 0.099368 0.095441 0.096343 0.095451 0.096201 0.099623 0.093659 0.099429 0.100367 0.110402 0.079213 0.085561 0.058358 0.081148 0.053815 0.052531 0.074182 0.084264 0.092462 0.079260 0.079252 0.091332
qa: -0.4241 -0.4043 -0.2446 0.0909 0.5654 -0.2130 -0.2495 0.2720 -0.2690 -0.2784 0.1970 -0.0163 -0.3597 -0.3627 -0.3823 -0.1875 -0.0632 -0.0387 -0.0724 -0.2797 -0.2847 0.0573 0.0876 0.0762 0.0679 0.0905 0.0796 0.0854 0.0879 0.0945 0.0969 0.0830 0.1063 0.0939 0.0994 0.0954 0.0963 0.0955 0.0962 0.0996 0.0937 0.0994 0.1004 0.1104 0.0792 0.0856 0.0584 0.0811 0.0538 0.0525 0.0742 0.0843 0.0925 0.0793 0.0793 0.0913
va: 1.9528 1.9947 2.8708 3.6737 3.7714 3.9093 3.9933 3.6614 4.0365 3.9950 3.7252 3.9812 3.9234 3.9235 3.9483 4.0655 3.8400 3.9244 3.8914 3.9163 3.9499 1.0173 1.0126 1.0201 1.0090 1.0157 1.0314 1.0162 1.0234 1.0168 1.0018 0.9985 0.9956 0.9971 1.0021 1.0070 1.0033 1.0056 1.0011 1.0054 0.9982 1.0007 0.9942 0.9980 1.0008 0.9967 0.9987 0.9887 1.0117 1.0131 1.0142 0.9990 1.0096 1.0004 1.0014 1.0036
dispcorr: -0.029495985 hartree
energy: -912.331063479084
dipole: 1.01375 -1.24795 -0.23420 -15.83625 15.85709 0.02084 -0.95204 1.26538 0.31334
magnitude: 0.39174 au
magnitude: 0.99573 debye
