program: Orca
programVersion: 5.0.2
elementType: O O N C C C C C C C C C C C C C C C C C C H H H H H H H H H H H H H H H H H H H H H H H H H H H H H H H H H H H
charge: 0
multiplicity: 1
keywords: wb97x-d3
keywords: def2-TZVPP
keywords: def2/J RIJCOSX
keywords: DEFGRID2
keywords: scfconv7
keywords: smallprint printgap noloewdin
keywords: NOSOSCF
formula: C18H35NO2
InChI: InChI=1/C18H35NO2/c1-6-12-19(7-2)13-16-14-20-18(21-16)10-8-15(9-11-18)17(3,4)5/h15-16H,6-14H2,1-5H3
56 atoms
O  -0.417302 0.834194 -0.323655
O  -0.21089 2.903049 0.503802
N  -2.742017 -1.182102 0.49972
C  3.125635 0.301496 -0.122817
C  0.539156 1.758445 0.162664
C  2.367422 0.874454 -1.324449
C  2.128877 -0.019942 0.995161
C  4.065585 -0.878912 -0.482007
C  1.51987 2.087016 -0.945872
C  1.284043 1.193091 1.369931
C  -1.694115 1.137318 0.22882
C  -1.442486 2.430278 1.011941
C  3.299017 -2.090965 -1.014991
C  5.079001 -0.431907 -1.540419
C  4.858395 -1.306254 0.757763
C  -2.24258 0.029287 1.124524
C  -3.951565 -0.960451 -0.282158
C  -1.72263 -1.924531 -0.231211
C  -5.212197 -0.822718 0.561839
C  -2.046018 -3.401764 -0.375757
C  -6.428173 -0.498524 -0.292458
H  3.778836 1.103078 0.253217
H  3.062703 1.180564 -2.107072
H  1.728041 0.105468 -1.767936
H  1.470505 -0.840187 0.692045
H  2.649525 -0.36274 1.890409
H  0.977628 2.461096 -1.818164
H  2.174166 2.893535 -0.602069
H  1.933126 1.978994 1.768383
H  0.584317 0.927763 2.167353
H  -2.378545 1.327691 -0.60356
H  -1.386586 2.242378 2.091573
H  -2.211835 3.182632 0.840361
H  2.590077 -2.484686 -0.284335
H  2.742952 -1.860808 -1.925612
H  3.991295 -2.900556 -1.257548
H  5.611109 0.46975 -1.226762
H  4.614375 -0.223523 -2.504916
H  5.825905 -1.211095 -1.708135
H  5.605926 -2.057059 0.492438
H  5.387266 -0.460354 1.204003
H  4.225788 -1.746197 1.529603
H  -3.056284 0.467005 1.710533
H  -1.468515 -0.241311 1.850219
H  -3.86405 -0.084933 -0.944487
H  -4.09166 -1.810817 -0.952509
H  -1.531662 -1.502491 -1.228203
H  -0.784171 -1.838089 0.32035
H  -5.087453 -0.04281 1.318074
H  -5.379894 -1.755848 1.106119
H  -2.153461 -3.881458 0.597447
H  -2.961871 -3.580162 -0.940487
H  -1.23848 -3.905224 -0.908443
H  -7.335011 -0.443101 0.310557
H  -6.590539 -1.257753 -1.060275
H  -6.312641 0.461001 -0.800266
elementType: O N C H
totalener: -912.30311538 hartree
nucrepener: 1911.84607178 hartree
electener: -2824.14918716 hartree
oneelecener: -5037.14425205 hartree
twoeener: 2212.99506489 hartree
cpcmener: -0.02114261 hartree
kineticenergy: 907.79790177 hartree
xcener: -92.073263773606 hartree
chargesum: 0.0000000
charge: -0.420513 -0.403764 -0.237795 0.096943 0.565500 -0.218121 -0.256597 0.271187 -0.270800 -0.278089 0.198099 -0.022797 -0.382157 -0.360531 -0.366558 -0.193668 -0.106956 -0.032071 -0.056531 -0.275441 -0.285872 0.057828 0.090198 0.077386 0.073291 0.090240 0.079511 0.085429 0.088425 0.094237 0.100265 0.083250 0.108653 0.095491 0.097864 0.099215 0.099792 0.094609 0.095355 0.095446 0.099184 0.095676 0.108848 0.108895 0.076502 0.101456 0.062641 0.076933 0.056733 0.047018 0.071442 0.083103 0.089527 0.091365 0.080372 0.080351
qa: -0.4205 -0.4038 -0.2378 0.0969 0.5655 -0.2181 -0.2566 0.2712 -0.2708 -0.2781 0.1981 -0.0228 -0.3822 -0.3605 -0.3666 -0.1937 -0.1070 -0.0321 -0.0565 -0.2754 -0.2859 0.0578 0.0902 0.0774 0.0733 0.0902 0.0795 0.0854 0.0884 0.0942 0.1003 0.0832 0.1087 0.0955 0.0979 0.0992 0.0998 0.0946 0.0954 0.0954 0.0992 0.0957 0.1088 0.1089 0.0765 0.1015 0.0626 0.0769 0.0567 0.0470 0.0714 0.0831 0.0895 0.0914 0.0804 0.0804
va: 1.9513 1.9975 2.8879 3.6698 3.7672 3.9117 3.9898 3.6647 4.0403 3.9947 3.7113 3.9947 3.9481 3.9192 3.9233 4.0493 3.9269 3.9017 3.8344 3.9334 3.9592 1.0173 1.0126 1.0197 1.0069 1.0150 1.0312 1.0161 1.0226 1.0162 1.0023 0.9987 0.9950 0.9994 0.9998 1.0050 1.0025 0.9992 1.0067 1.0064 1.0026 0.9987 0.9905 0.9998 1.0023 0.9928 0.9996 0.9878 1.0147 1.0190 1.0146 1.0047 1.0071 1.0041 0.9998 1.0005
dispcorr: -0.029418564 hartree
energy: -912.332533944812
dipole: 1.57553 -1.79274 -0.21721 -14.35056 14.35157 0.00101 -2.62170 2.92452 0.30282
magnitude: 0.37267 au
magnitude: 0.94725 debye
