program: Orca
programVersion: 5.0.2
elementType: O O N C C C C C C C C C C C C C C C C C C H H H H H H H H H H H H H H H H H H H H H H H H H H H H H H H H H H H
charge: 0
multiplicity: 1
keywords: wb97x-d3
keywords: def2-TZVPP
keywords: def2/J RIJCOSX
keywords: DEFGRID2
keywords: scfconv7
keywords: smallprint printgap noloewdin
keywords: NOSOSCF
formula: C18H35NO2
InChI: InChI=1/C18H35NO2/c1-6-12-19(7-2)13-16-14-20-18(21-16)10-8-15(9-11-18)17(3,4)5/h15-16H,6-14H2,1-5H3
56 atoms
O  -0.556611 1.084702 -0.541988
O  -0.168784 3.19054 0.092625
N  -3.085782 -0.60103 0.297818
C  2.817688 0.122587 0.179414
C  0.453925 1.930982 -0.027184
C  2.30008 0.650823 -1.162573
C  1.667615 0.078837 1.189361
C  3.594857 -1.21576 0.070485
C  1.595727 1.999249 -1.022713
C  0.969437 1.427817 1.319865
C  -1.831562 1.583341 -0.154421
C  -1.502098 2.936342 0.490669
C  4.23504 -1.547827 1.42172
C  2.691786 -2.379083 -0.34461
C  4.725349 -1.0800 -0.953866
C  -2.573859 0.659608 0.8056
C  -2.037411 -1.547474 -0.064102
C  -4.058332 -0.450702 -0.776701
C  -2.458646 -3.00893 0.015838
C  -5.267511 0.394085 -0.41711
C  -1.303421 -3.928908 -0.353344
H  3.542264 0.862407 0.550823
H  3.123408 0.774303 -1.867327
H  1.61684 -0.073311 -1.616578
H  0.938231 -0.681167 0.894908
H  2.031553 -0.21647 2.174705
H  1.22106 2.336274 -1.992729
H  2.313298 2.748642 -0.676214
H  1.678502 2.16654 1.70664
H  0.158135 1.360572 2.049618
H  -2.420062 1.731663 -1.06564
H  -1.59483 2.893823 1.583119
H  -2.140435 3.742535 0.129991
H  3.495125 -1.744429 2.198529
H  4.860077 -2.439918 1.341167
H  4.872284 -0.731178 1.770016
H  2.185441 -2.191357 -1.293331
H  1.925353 -2.593622 0.402595
H  3.281078 -3.290404 -0.469983
H  4.355626 -0.988574 -1.976004
H  5.347535 -0.205672 -0.746497
H  5.374567 -1.95793 -0.926513
H  -3.410948 1.233129 1.214465
H  -1.923694 0.445663 1.659023
H  -1.6388 -1.354066 -1.072475
H  -1.201342 -1.407578 0.62513
H  -3.600278 -0.047322 -1.693584
H  -4.412298 -1.447628 -1.044036
H  -3.302907 -3.209331 -0.648517
H  -2.799872 -3.232782 1.029565
H  -5.755505 0.03111 0.488083
H  -5.022139 1.446161 -0.270007
H  -5.996801 0.346384 -1.226389
H  -1.589331 -4.978492 -0.279999
H  -0.445711 -3.774869 0.305251
H  -0.964452 -3.752566 -1.376041
elementType: O N C H
totalener: -912.30375015 hartree
nucrepener: 1946.17677917 hartree
electener: -2858.48052932 hartree
oneelecener: -5105.83407549 hartree
twoeener: 2247.35354616 hartree
cpcmener: -0.02122168 hartree
kineticenergy: 907.79978072 hartree
xcener: -92.075246332972 hartree
chargesum: 0.0000000
charge: -0.415509 -0.404032 -0.218953 0.100197 0.555832 -0.214725 -0.241326 0.278077 -0.264815 -0.277118 0.205069 -0.018653 -0.365094 -0.393276 -0.360454 -0.213887 -0.083423 -0.083230 -0.064031 -0.266772 -0.293170 0.057266 0.088666 0.075594 0.053044 0.091393 0.078634 0.084876 0.088352 0.096054 0.099777 0.083224 0.107009 0.096192 0.095645 0.097944 0.101737 0.088544 0.101636 0.094654 0.099906 0.095730 0.111943 0.113481 0.061721 0.090157 0.072099 0.093471 0.059526 0.045910 0.079936 0.084050 0.095193 0.096479 0.076815 0.082632
qa: -0.4155 -0.4040 -0.2190 0.1002 0.5558 -0.2147 -0.2413 0.2781 -0.2648 -0.2771 0.2051 -0.0187 -0.3651 -0.3933 -0.3605 -0.2139 -0.0834 -0.0832 -0.0640 -0.2668 -0.2932 0.0573 0.0887 0.0756 0.0530 0.0914 0.0786 0.0849 0.0884 0.0961 0.0998 0.0832 0.1070 0.0962 0.0956 0.0979 0.1017 0.0885 0.1016 0.0947 0.0999 0.0957 0.1119 0.1135 0.0617 0.0902 0.0721 0.0935 0.0595 0.0459 0.0799 0.0840 0.0952 0.0965 0.0768 0.0826
va: 1.9571 1.9959 2.9148 3.6730 3.7802 3.9121 4.0029 3.6624 4.0366 3.9969 3.7037 3.9853 3.9221 3.9579 3.9215 4.0524 3.9437 3.9332 3.8401 3.9061 3.9559 1.0177 1.0122 1.0206 1.0134 1.0150 1.0316 1.0162 1.0231 1.0163 0.9961 0.9988 0.9958 0.9997 1.0058 1.0032 0.9992 0.9947 1.0063 0.9975 1.0020 1.0072 0.9895 0.9999 1.0038 0.9889 0.9966 0.9868 1.0147 1.0221 1.0121 0.9986 1.0053 1.0062 0.9999 1.0000
dispcorr: -0.030822420 hartree
energy: -912.334572572085
dipole: 4.08780 -4.34549 -0.25769 -17.13578 17.14574 0.00996 -0.05641 0.33930 0.28289
magnitude: 0.38279 au
magnitude: 0.97298 debye
