program: Orca
programVersion: 5.0.2
elementType: O O N C C C C C C C C C C C C C C C C C C H H H H H H H H H H H H H H H H H H H H H H H H H H H H H H H H H H H
charge: 0
multiplicity: 1
keywords: wb97x-d3
keywords: def2-TZVPP
keywords: def2/J RIJCOSX
keywords: DEFGRID2
keywords: scfconv7
keywords: smallprint printgap noloewdin
keywords: NOSOSCF
formula: C18H35NO2
InChI: InChI=1/C18H35NO2/c1-6-12-19(7-2)13-16-14-20-18(21-16)10-8-15(9-11-18)17(3,4)5/h15-16H,6-14H2,1-5H3
56 atoms
O  -0.109989 0.349453 -0.808655
O  -0.313143 2.498861 -0.207244
N  -3.486099 -0.326043 0.572545
C  3.361254 0.366585 0.196826
C  0.610461 1.435682 -0.245842
C  2.834374 0.710864 -1.199676
C  2.180706 -0.021769 1.091981
C  4.516826 -0.668269 0.2003
C  1.768003 1.802721 -1.15464
C  1.12438 1.078151 1.146497
C  -1.503759 0.556626 -0.606748
C  -1.574119 1.922903 0.076263
C  4.068578 -2.039831 -0.306194
C  5.664759 -0.170128 -0.683117
C  5.064236 -0.822933 1.622823
C  -2.094327 -0.563436 0.23275
C  -4.383404 -0.332762 -0.575931
C  -3.935886 -1.223191 1.629693
C  -4.486893 -1.621723 -1.389319
C  -3.387945 -0.865144 3.000458
C  -5.529631 -1.485129 -2.488328
H  3.787395 1.292042 0.612022
H  3.643353 1.060711 -1.842499
H  2.426931 -0.182843 -1.681667
H  1.723612 -0.947697 0.730579
H  2.51604 -0.224148 2.110362
H  1.393585 2.014142 -2.159713
H  2.216993 2.726503 -0.778071
H  1.561053 1.977998 1.590617
H  0.299941 0.772979 1.797133
H  -1.977341 0.592516 -1.593274
H  -1.737155 1.826501 1.155877
H  -2.355706 2.565181 -0.329345
H  3.292249 -2.478072 0.323266
H  3.68257 -1.995396 -1.326277
H  4.90979 -2.736821 -0.310846
H  5.979376 0.837678 -0.40026
H  5.400847 -0.150256 -1.741192
H  6.533745 -0.824105 -0.583428
H  5.95327 -1.45763 1.625148
H  5.350246 0.143107 2.046607
H  4.343837 -1.281131 2.301676
H  -1.517633 -0.613128 1.159082
H  -1.938906 -1.526816 -0.276776
H  -5.380408 -0.073925 -0.206652
H  -4.104395 0.484907 -1.247096
H  -5.026028 -1.163491 1.670115
H  -3.696927 -2.274886 1.410519
H  -4.752015 -2.458697 -0.737663
H  -3.520903 -1.871507 -1.836023
H  -3.646951 0.157787 3.276589
H  -3.813836 -1.530564 3.753096
H  -2.303807 -0.966534 3.06353
H  -6.516235 -1.269838 -2.073546
H  -5.614415 -2.398372 -3.077744
H  -5.278948 -0.674054 -3.174845
elementType: O N C H
totalener: -912.30305180 hartree
nucrepener: 1883.38813259 hartree
electener: -2795.69118440 hartree
oneelecener: -4980.19337161 hartree
twoeener: 2184.50218721 hartree
cpcmener: -0.01979741 hartree
kineticenergy: 907.80393264 hartree
xcener: -92.074353113549 hartree
chargesum: -0.0000000
charge: -0.449625 -0.408472 -0.218218 0.089840 0.590854 -0.217889 -0.247707 0.264114 -0.271498 -0.304129 0.269820 -0.018470 -0.379207 -0.360196 -0.362059 -0.255641 -0.108421 -0.044032 -0.083043 -0.264445 -0.284159 0.056271 0.088836 0.077352 0.083149 0.090469 0.081161 0.085879 0.088924 0.094399 0.091069 0.077859 0.107461 0.095876 0.098311 0.099198 0.099436 0.093558 0.095572 0.095735 0.098794 0.094733 0.119015 0.098534 0.089779 0.087210 0.084046 0.060756 0.068107 0.062931 0.072264 0.093580 0.078363 0.080354 0.092148 0.081455
qa: -0.4496 -0.4085 -0.2182 0.0898 0.5909 -0.2179 -0.2477 0.2641 -0.2715 -0.3041 0.2698 -0.0185 -0.3792 -0.3602 -0.3621 -0.2556 -0.1084 -0.0440 -0.0830 -0.2644 -0.2842 0.0563 0.0888 0.0774 0.0831 0.0905 0.0812 0.0859 0.0889 0.0944 0.0911 0.0779 0.1075 0.0959 0.0983 0.0992 0.0994 0.0936 0.0956 0.0957 0.0988 0.0947 0.1190 0.0985 0.0898 0.0872 0.0840 0.0608 0.0681 0.0629 0.0723 0.0936 0.0784 0.0804 0.0921 0.0815
va: 1.9656 1.9955 2.8579 3.6787 3.7521 3.9062 3.9431 3.6673 4.0526 4.0200 3.7286 3.9691 3.9455 3.9225 3.9225 4.0722 3.9675 3.8964 3.8261 3.9258 3.9560 1.0177 1.0128 1.0215 1.0158 1.0133 1.0291 1.0161 1.0222 1.0088 0.9972 1.0099 0.9938 0.9998 1.0001 1.0041 1.0023 0.9990 1.0067 1.0061 1.0030 1.0001 0.9851 1.0108 0.9996 0.9947 0.9904 0.9972 1.0076 1.0073 1.0141 1.0075 1.0031 1.0012 1.0022 1.0011
dispcorr: -0.028578847 hartree
energy: -912.331630649368
dipole: 1.93012 -2.43802 -0.50790 -12.37184 11.68291 -0.68893 2.85741 -2.45595 0.40146
magnitude: 0.94539 au
magnitude: 2.40299 debye
