program: Orca
programVersion: 5.0.2
elementType: O O N C C C C C C C C C C C C C C C C C C H H H H H H H H H H H H H H H H H H H H H H H H H H H H H H H H H H H
charge: 0
multiplicity: 1
keywords: wb97x-d3
keywords: def2-TZVPP
keywords: def2/J RIJCOSX
keywords: DEFGRID2
keywords: scfconv7
keywords: smallprint printgap noloewdin
keywords: NOSOSCF
formula: C18H35NO2
InChI: InChI=1/C18H35NO2/c1-6-12-19(7-2)13-16-14-20-18(21-16)10-8-15(9-11-18)17(3,4)5/h15-16H,6-14H2,1-5H3
56 atoms
O  -0.289754 0.677117 0.040287
O  -0.073623 2.89702 0.419606
N  -3.062152 -0.885059 0.250272
C  3.265296 0.29084 -0.132657
C  0.668224 1.713878 0.200735
C  2.352016 0.61978 -1.318085
C  2.416796 0.149438 1.135193
C  4.214261 -0.909766 -0.388937
C  1.500095 1.860272 -1.062472
C  1.565646 1.390343 1.388107
C  -1.603789 1.209023 0.157603
C  -1.353727 2.517759 0.883675
C  3.451504 -2.211776 -0.638535
C  5.099163 -0.617102 -1.604529
C  5.138188 -1.106594 0.816824
C  -2.525101 0.275274 0.933098
C  -4.048484 -0.536808 -0.764461
C  -2.052492 -1.823344 -0.218239
C  -5.445451 -0.300324 -0.203779
C  -2.590465 -3.235725 -0.37485
C  -6.095403 -1.555505 0.356755
H  3.918493 1.163278 0.018074
H  2.939138 0.790954 -2.221374
H  1.697563 -0.22934 -1.536046
H  1.769235 -0.729404 1.06126
H  3.051255 -0.012069 2.007831
H  0.843494 2.054179 -1.915157
H  2.150905 2.73319 -0.95362
H  2.222181 2.247962 1.562941
H  0.960696 1.260816 2.290255
H  -2.00965 1.410942 -0.841989
H  -1.366636 2.381234 1.973483
H  -2.074576 3.293634 0.626546
H  4.150647 -3.034838 -0.803245
H  2.822388 -2.490316 0.208641
H  2.811852 -2.152925 -1.520812
H  5.621792 0.336579 -1.49511
H  4.533058 -0.580103 -2.535943
H  5.857901 -1.393907 -1.722536
H  4.603158 -1.447383 1.703976
H  5.899945 -1.857433 0.595673
H  5.656884 -0.180442 1.077047
H  -3.369324 0.876475 1.28496
H  -1.995048 -0.048736 1.834682
H  -3.740468 0.343505 -1.34655
H  -4.109385 -1.35021 -1.490398
H  -1.591344 -1.5057 -1.165301
H  -1.247729 -1.847644 0.519482
H  -6.06552 0.097631 -1.011586
H  -5.418545 0.480522 0.561856
H  -1.793182 -3.903808 -0.703456
H  -2.978114 -3.617964 0.569969
H  -3.388597 -3.300483 -1.115549
H  -5.532188 -1.96787 1.193116
H  -6.168188 -2.33411 -0.405557
H  -7.105927 -1.352881 0.714028
elementType: O N C H
totalener: -912.30138953 hartree
nucrepener: 1898.76733687 hartree
electener: -2811.06872640 hartree
oneelecener: -5011.18012838 hartree
twoeener: 2200.11140199 hartree
cpcmener: -0.01946952 hartree
kineticenergy: 907.80155710 hartree
xcener: -92.072671566711 hartree
chargesum: 0.0000000
charge: -0.406284 -0.411683 -0.234454 0.086554 0.578750 -0.226359 -0.235172 0.268475 -0.276004 -0.270285 0.145803 0.002419 -0.378621 -0.362061 -0.362818 -0.155992 -0.091911 -0.034290 -0.089672 -0.280775 -0.274556 0.058128 0.088362 0.078123 0.078145 0.089154 0.081557 0.085288 0.081733 0.085978 0.083103 0.080005 0.107779 0.098778 0.096571 0.096173 0.098856 0.094454 0.095457 0.094943 0.095056 0.099069 0.106380 0.094655 0.089115 0.097800 0.064789 0.073957 0.065095 0.057924 0.094531 0.073572 0.081620 0.068463 0.077655 0.096669
qa: -0.4063 -0.4117 -0.2345 0.0866 0.5788 -0.2264 -0.2352 0.2685 -0.2760 -0.2703 0.1458 0.0024 -0.3786 -0.3621 -0.3628 -0.1560 -0.0919 -0.0343 -0.0897 -0.2808 -0.2746 0.0581 0.0884 0.0781 0.0781 0.0892 0.0816 0.0853 0.0817 0.0860 0.0831 0.0800 0.1078 0.0988 0.0966 0.0962 0.0989 0.0945 0.0955 0.0949 0.0951 0.0991 0.1064 0.0947 0.0891 0.0978 0.0648 0.0740 0.0651 0.0579 0.0945 0.0736 0.0816 0.0685 0.0777 0.0967
va: 1.9640 1.9866 2.8506 3.6922 3.7308 3.9239 3.9440 3.6601 4.0576 4.0392 3.7964 3.9971 3.9460 3.9214 3.9241 4.0393 3.8967 3.8940 3.8483 3.9236 3.9151 1.0173 1.0144 1.0167 1.0146 1.0126 1.0222 1.0166 1.0211 1.0150 1.0105 0.9993 0.9949 1.0044 1.0005 0.9998 1.0026 0.9993 1.0064 0.9985 1.0068 1.0025 0.9926 1.0082 1.0145 0.9906 0.9986 0.9975 1.0140 1.0097 1.0093 1.0114 1.0031 1.0217 1.0008 1.0060
dispcorr: -0.029110592 hartree
energy: -912.330500122711
dipole: 1.39549 -1.61450 -0.21901 -15.00604 15.19527 0.18923 -2.54877 2.49088 -0.05789
magnitude: 0.29517 au
magnitude: 0.75027 debye
