program: Orca
programVersion: 5.0.2
elementType: O O N C C C C C C C C C C C C C C C C C C H H H H H H H H H H H H H H H H H H H H H H H H H H H H H H H H H H H
charge: 0
multiplicity: 1
keywords: wb97x-d3
keywords: def2-TZVPP
keywords: def2/J RIJCOSX
keywords: DEFGRID2
keywords: scfconv7
keywords: smallprint printgap noloewdin
keywords: NOSOSCF
formula: C18H35NO2
InChI: InChI=1/C18H35NO2/c1-6-12-19(7-2)13-16-14-20-18(21-16)10-8-15(9-11-18)17(3,4)5/h15-16H,6-14H2,1-5H3
56 atoms
O  -0.021824 0.22232 -0.666229
O  -0.376721 1.397905 1.227997
N  -3.657071 -0.367787 -0.307889
C  3.533374 0.213756 0.047115
C  0.641152 0.8206 0.441471
C  2.794626 1.23902 -0.817911
C  2.532345 -0.852999 0.500175
C  4.820035 -0.357805 -0.601572
C  1.627946 1.868939 -0.06162
C  1.36023 -0.238701 1.259664
C  -1.400232 0.570571 -0.64969
C  -1.449582 1.70679 0.359645
C  4.525515 -1.149771 -1.875608
C  5.78039 0.786583 -0.941727
C  5.536294 -1.273669 0.395898
C  -2.230963 -0.637098 -0.232637
C  -4.39128 -1.132185 0.692769
C  -4.161606 -0.601261 -1.656066
C  -4.303773 -0.534482 2.089981
C  -5.478579 0.097279 -1.941085
C  -5.013388 -1.398024 3.121614
H  3.865782 0.743561 0.952357
H  3.466231 2.037648 -1.135964
H  2.427967 0.764678 -1.733354
H  2.156749 -1.407846 -0.364925
H  3.011026 -1.587236 1.149636
H  1.113233 2.598391 -0.693529
H  2.016921 2.413687 0.803913
H  1.731783 0.230462 2.175632
H  0.648769 -1.012359 1.561541
H  -1.690716 0.912946 -1.647029
H  -2.374794 1.733047 0.934256
H  -1.313804 2.682136 -0.120695
H  4.039765 -0.537349 -2.637489
H  5.453412 -1.528191 -2.310726
H  3.884949 -2.012618 -1.684687
H  5.962577 1.423609 -0.072549
H  5.409273 1.422036 -1.746666
H  6.745394 0.391264 -1.266173
H  6.504613 -1.587099 -0.000271
H  5.720408 -0.761598 1.343789
H  4.972004 -2.18119 0.614123
H  -1.962237 -0.8935 0.794944
H  -1.947097 -1.506529 -0.845659
H  -5.444192 -1.165086 0.406153
H  -4.055123 -2.182042 0.716466
H  -3.421764 -0.227847 -2.36678
H  -4.257952 -1.678882 -1.864272
H  -4.745722 0.464897 2.077475
H  -3.259325 -0.405041 2.387102
H  -5.781735 -0.086949 -2.972207
H  -6.288573 -0.253591 -1.300836
H  -5.387844 1.175455 -1.807499
H  -4.57657 -2.39704 3.172759
H  -6.072464 -1.514263 2.884258
H  -4.946798 -0.960416 4.117995
elementType: O N C H
totalener: -912.30436845 hartree
nucrepener: 1868.41728491 hartree
electener: -2780.72165336 hartree
oneelecener: -4950.46971197 hartree
twoeener: 2169.74805861 hartree
cpcmener: -0.01831359 hartree
kineticenergy: 907.81176191 hartree
xcener: -92.070892101367 hartree
chargesum: -0.0000000
charge: -0.452749 -0.419536 -0.250168 0.081878 0.578630 -0.228407 -0.223795 0.265568 -0.278288 -0.276992 0.267799 -0.012395 -0.375339 -0.361717 -0.361747 -0.219355 -0.098936 -0.047598 -0.067862 -0.262983 -0.283971 0.057485 0.088932 0.077325 0.079043 0.089364 0.086687 0.081320 0.088003 0.086094 0.095081 0.098443 0.094504 0.096924 0.098247 0.096324 0.099357 0.094087 0.095386 0.095149 0.099229 0.094653 0.115889 0.091222 0.097558 0.075939 0.086123 0.067292 0.051667 0.054761 0.090912 0.080693 0.071655 0.079533 0.081240 0.091839
qa: -0.4527 -0.4195 -0.2502 0.0819 0.5786 -0.2284 -0.2238 0.2656 -0.2783 -0.2770 0.2678 -0.0124 -0.3753 -0.3617 -0.3617 -0.2194 -0.0989 -0.0476 -0.0679 -0.2630 -0.2840 0.0575 0.0889 0.0773 0.0790 0.0894 0.0867 0.0813 0.0880 0.0861 0.0951 0.0984 0.0945 0.0969 0.0982 0.0963 0.0994 0.0941 0.0954 0.0951 0.0992 0.0947 0.1159 0.0912 0.0976 0.0759 0.0861 0.0673 0.0517 0.0548 0.0909 0.0807 0.0717 0.0795 0.0812 0.0918
va: 1.9670 1.9709 2.8033 3.6837 3.7708 3.9258 3.9231 3.6600 4.0733 4.0454 3.7748 3.9481 3.9449 3.9247 3.9224 3.9665 3.9150 3.8998 3.8344 3.9280 3.9637 1.0172 1.0130 1.0217 1.0191 1.0142 1.0132 1.0212 1.0180 1.0187 1.0036 1.0127 0.9964 1.0000 1.0042 0.9996 1.0025 0.9994 1.0065 1.0064 1.0027 1.0003 0.9898 1.0226 0.9911 1.0045 0.9878 1.0069 1.0186 1.0148 1.0071 1.0035 1.0133 1.0015 0.9999 1.0035
dispcorr: -0.027998495 hartree
energy: -912.332366942562
dipole: 1.39738 -1.73565 -0.33826 -6.81421 6.70065 -0.11356 -1.07903 0.74670 -0.33233
magnitude: 0.48761 au
magnitude: 1.23940 debye
