program: Orca
programVersion: 5.0.2
elementType: O O N C C C C C C C C C C C C C C C C C C H H H H H H H H H H H H H H H H H H H H H H H H H H H H H H H H H H H
charge: 0
multiplicity: 1
keywords: wb97x-d3
keywords: def2-TZVPP
keywords: def2/J RIJCOSX
keywords: DEFGRID2
keywords: scfconv7
keywords: smallprint printgap noloewdin
keywords: NOSOSCF
formula: C18H35NO2
InChI: InChI=1/C18H35NO2/c1-6-12-19(7-2)13-16-14-20-18(21-16)10-8-15(9-11-18)17(3,4)5/h15-16H,6-14H2,1-5H3
56 atoms
O  -0.594246 0.891598 -0.467684
O  -0.206734 3.065615 -0.105769
N  -3.235367 -0.614255 0.607713
C  2.830384 0.0708 0.162174
C  0.425954 1.805716 -0.113138
C  2.235763 0.432347 -1.202711
C  1.723569 0.105651 1.220057
C  3.652414 -1.244468 0.163991
C  1.509268 1.77554 -1.173736
C  1.013773 1.455604 1.25161
C  -1.864449 1.433626 -0.128164
C  -1.524571 2.847868 0.35791
C  2.773578 -2.476533 -0.05742
C  4.715408 -1.196048 -0.93735
C  4.380834 -1.391116 1.503003
C  -2.593387 0.63637 0.948094
C  -2.369501 -1.76409 0.400562
C  -4.315061 -0.522581 -0.358286
C  -1.833897 -2.053199 -1.003075
C  -5.436463 0.417624 0.050595
C  -0.947714 -3.290703 -0.988967
H  3.541582 0.870516 0.417227
H  3.017879 0.490925 -1.960531
H  1.547826 -0.351507 -1.534999
H  0.990354 -0.683615 1.025642
H  2.130007 -0.094321 2.21282
H  1.072189 1.995901 -2.151246
H  2.229156 2.569578 -0.955272
H  1.729471 2.236239 1.52725
H  0.23512 1.454158 2.01963
H  -2.467157 1.476817 -1.041816
H  -1.583703 2.921185 1.451375
H  -2.18174 3.607277 -0.065943
H  2.061604 -2.626835 0.756062
H  2.205942 -2.414127 -0.987855
H  3.389085 -3.37724 -0.115703
H  4.283022 -1.243842 -1.937601
H  5.400461 -2.041748 -0.84505
H  5.312479 -0.282554 -0.876828
H  3.695215 -1.507669 2.343273
H  5.028251 -2.270744 1.493893
H  5.010971 -0.522073 1.707783
H  -3.357266 1.302543 1.361848
H  -1.895788 0.453792 1.771593
H  -1.525596 -1.672049 1.090914
H  -2.916709 -2.659899 0.720615
H  -3.969575 -0.235624 -1.362334
H  -4.733095 -1.527409 -0.467597
H  -1.268434 -1.206618 -1.391871
H  -2.664276 -2.21616 -1.695128
H  -5.129098 1.463988 0.057801
H  -6.257754 0.332593 -0.662001
H  -5.828581 0.173038 1.038417
H  -0.09153 -3.157853 -0.325413
H  -0.559402 -3.516756 -1.982442
H  -1.495585 -4.169344 -0.643152
elementType: O N C H
totalener: -912.30001145 hartree
nucrepener: 1960.01219979 hartree
electener: -2872.31221123 hartree
oneelecener: -5133.51194448 hartree
twoeener: 2261.19973325 hartree
cpcmener: -0.01931798 hartree
kineticenergy: 907.80983309 hartree
xcener: -92.079669767090 hartree
chargesum: 0.0000000
charge: -0.409819 -0.404725 -0.229560 0.094519 0.552246 -0.219819 -0.230405 0.284939 -0.263556 -0.280398 0.209493 -0.018096 -0.408424 -0.361506 -0.362604 -0.227234 -0.085498 -0.051446 -0.105586 -0.279059 -0.295086 0.057487 0.088843 0.077095 0.055494 0.091093 0.078464 0.084915 0.087860 0.094012 0.101167 0.082479 0.107971 0.097341 0.098515 0.105247 0.094881 0.096070 0.099678 0.095541 0.096016 0.097610 0.110262 0.114050 0.083192 0.089574 0.064623 0.086150 0.066183 0.069520 0.084560 0.093741 0.079773 0.072895 0.097932 0.091391
qa: -0.4098 -0.4047 -0.2296 0.0945 0.5522 -0.2198 -0.2304 0.2849 -0.2636 -0.2804 0.2095 -0.0181 -0.4084 -0.3615 -0.3626 -0.2272 -0.0855 -0.0514 -0.1056 -0.2791 -0.2951 0.0575 0.0888 0.0771 0.0555 0.0911 0.0785 0.0849 0.0879 0.0940 0.1012 0.0825 0.1080 0.0973 0.0985 0.1052 0.0949 0.0961 0.0997 0.0955 0.0960 0.0976 0.1103 0.1141 0.0832 0.0896 0.0646 0.0861 0.0662 0.0695 0.0846 0.0937 0.0798 0.0729 0.0979 0.0914
va: 1.9521 1.9944 2.9171 3.6665 3.7870 3.9302 3.9867 3.6452 4.0354 3.9937 3.6557 3.9908 3.9591 3.9233 3.9220 4.0791 3.9282 3.9087 3.7801 3.9215 3.9491 1.0175 1.0135 1.0074 1.0122 1.0154 1.0316 1.0164 1.0230 1.0153 0.9974 0.9988 0.9947 0.9909 0.9954 1.0084 0.9970 1.0075 1.0021 1.0009 1.0055 1.0032 0.9858 1.0011 1.0001 0.9969 0.9875 0.9876 1.0291 1.0105 0.9973 1.0054 1.0121 0.9970 1.0012 1.0066
dispcorr: -0.031896214 hartree
energy: -912.331907661380
dipole: 4.68326 -4.93209 -0.24883 -15.64841 15.69412 0.04571 -0.06371 0.30331 0.23960
magnitude: 0.34845 au
magnitude: 0.88568 debye
