program: Orca
programVersion: 5.0.2
elementType: O O N C C C C C C C C C C C C C C C C C C H H H H H H H H H H H H H H H H H H H H H H H H H H H H H H H H H H H
charge: 0
multiplicity: 1
keywords: wb97x-d3
keywords: def2-TZVPP
keywords: def2/J RIJCOSX
keywords: DEFGRID2
keywords: scfconv7
keywords: smallprint printgap noloewdin
keywords: NOSOSCF
formula: C18H35NO2
InChI: InChI=1/C18H35NO2/c1-6-12-19(7-2)13-16-14-20-18(21-16)10-8-15(9-11-18)17(3,4)5/h15-16H,6-14H2,1-5H3
56 atoms
O  0.027749 -0.036569 -0.464474
O  -0.320782 2.181881 -0.217245
N  -3.603033 -0.129841 0.280088
C  3.575901 0.508535 0.112722
C  0.690962 1.19854 -0.21712
C  2.886688 0.473288 -1.25482
C  2.535063 0.199915 1.193198
C  4.85631 -0.361853 0.204828
C  1.717811 1.453871 -1.315222
C  1.363158 1.176178 1.145943
C  -1.355204 0.196136 -0.703505
C  -1.388456 1.685247 -1.001905
C  5.845864 0.051847 -0.888726
C  5.54162 -0.124983 1.554237
C  4.558864 -1.854602 0.057659
C  -2.171895 -0.205643 0.523541
C  -4.085451 -1.313762 -0.419643
C  -4.351539 0.173507 1.494363
C  -5.506075 -1.191123 -0.950919
C  -4.350806 -0.8899 2.587056
C  -5.907423 -2.418143 -1.756423
H  3.908197 1.545067 0.273739
H  3.586878 0.731023 -2.050608
H  2.534286 -0.539691 -1.472766
H  2.164865 -0.822977 1.074763
H  2.978464 0.250534 2.188692
H  1.23533 1.413601 -2.296077
H  2.101209 2.470999 -1.189843
H  1.726203 2.184567 1.366575
H  0.624449 0.925753 1.912477
H  -1.658983 -0.388833 -1.575661
H  -2.312288 2.172192 -0.693021
H  -1.233819 1.885426 -2.068254
H  5.496516 -0.204958 -1.889491
H  6.035533 1.128061 -0.868793
H  6.804373 -0.452043 -0.746017
H  4.946433 -0.480534 2.396133
H  5.744091 0.936767 1.716012
H  6.498097 -0.650697 1.595437
H  4.079847 -2.086914 -0.895424
H  5.48535 -2.431824 0.101983
H  3.911565 -2.226693 0.853658
H  -1.918505 0.473531 1.342705
H  -1.851636 -1.20874 0.844042
H  -3.425993 -1.492578 -1.272472
H  -4.00925 -2.218956 0.203945
H  -3.946585 1.102244 1.903421
H  -5.383558 0.402194 1.220687
H  -5.58274 -0.29846 -1.576741
H  -6.21514 -1.058105 -0.130274
H  -4.829818 -1.816283 2.267428
H  -3.340994 -1.133452 2.92217
H  -4.902364 -0.52451 3.454496
H  -5.242123 -2.571136 -2.608031
H  -6.921451 -2.321383 -2.14502
H  -5.875467 -3.322931 -1.146951
elementType: O N C H
totalener: -912.30387918 hartree
nucrepener: 1859.25257835 hartree
electener: -2771.55645753 hartree
oneelecener: -4932.13850398 hartree
twoeener: 2160.58204646 hartree
cpcmener: -0.01870489 hartree
kineticenergy: 907.78987391 hartree
xcener: -92.069994348338 hartree
chargesum: -0.0000000
charge: -0.449394 -0.420774 -0.221127 0.084222 0.577533 -0.226849 -0.225261 0.264419 -0.276150 -0.278240 0.237793 -0.000879 -0.363420 -0.361460 -0.375306 -0.192857 -0.124617 -0.066997 -0.061912 -0.280811 -0.286697 0.057877 0.088583 0.076947 0.079467 0.088875 0.085934 0.080948 0.088842 0.088313 0.098366 0.093744 0.090191 0.093652 0.100034 0.095761 0.095080 0.098411 0.095973 0.097165 0.098278 0.096079 0.103583 0.084337 0.092439 0.073319 0.079421 0.086385 0.053686 0.062627 0.085365 0.088736 0.096629 0.080799 0.092366 0.080575
qa: -0.4494 -0.4208 -0.2211 0.0842 0.5775 -0.2268 -0.2253 0.2644 -0.2762 -0.2782 0.2378 -0.0009 -0.3634 -0.3615 -0.3753 -0.1929 -0.1246 -0.0670 -0.0619 -0.2808 -0.2867 0.0579 0.0886 0.0769 0.0795 0.0889 0.0859 0.0809 0.0888 0.0883 0.0984 0.0937 0.0902 0.0937 0.1000 0.0958 0.0951 0.0984 0.0960 0.0972 0.0983 0.0961 0.1036 0.0843 0.0924 0.0733 0.0794 0.0864 0.0537 0.0626 0.0854 0.0887 0.0966 0.0808 0.0924 0.0806
va: 1.9673 1.9760 2.8534 3.6808 3.7666 3.9244 3.9288 3.6631 4.0728 4.0438 3.8163 3.9560 3.9255 3.9218 3.9447 3.9656 3.9610 3.9352 3.8283 3.8957 3.9575 1.0169 1.0128 1.0215 1.0181 1.0148 1.0141 1.0211 1.0177 1.0155 1.0049 1.0181 0.9956 0.9987 1.0023 1.0066 1.0009 1.0030 1.0060 1.0005 1.0041 0.9995 1.0004 1.0149 0.9939 0.9968 0.9991 0.9922 1.0196 1.0084 0.9974 0.9996 1.0093 1.0007 1.0036 1.0001
dispcorr: -0.027918103 hartree
energy: -912.331797280459
dipole: 1.15851 -1.54656 -0.38804 -10.69961 10.36441 -0.33521 2.76943 -2.80107 -0.03164
magnitude: 0.51375 au
magnitude: 1.30586 debye
