program: Orca
programVersion: 5.0.2
elementType: O O N C C C C C C C C C C C C C C C C C C H H H H H H H H H H H H H H H H H H H H H H H H H H H H H H H H H H H
charge: 0
multiplicity: 1
keywords: wb97x-d3
keywords: def2-TZVPP
keywords: def2/J RIJCOSX
keywords: DEFGRID2
keywords: scfconv7
keywords: smallprint printgap noloewdin
keywords: NOSOSCF
formula: C18H35NO2
InChI: InChI=1/C18H35NO2/c1-6-12-19(7-2)13-16-14-20-18(21-16)10-8-15(9-11-18)17(3,4)5/h15-16H,6-14H2,1-5H3
56 atoms
O  -0.487689 1.156278 -0.594297
O  -0.032334 3.24474 0.061824
N  -2.763495 -0.474513 0.235822
C  2.671532 -0.068548 0.407527
C  0.509652 1.946811 0.015482
C  2.35235 0.539858 -0.963111
C  1.437254 0.001882 1.313994
C  3.288258 -1.491817 0.320092
C  1.749177 1.937951 -0.858649
C  0.857365 1.410861 1.401883
C  -1.758315 1.738069 -0.380034
C  -1.43196 3.125466 0.200442
C  3.780594 -1.930919 1.702181
C  2.285044 -2.528151 -0.193806
C  4.499931 -1.479729 -0.616645
C  -2.631184 0.928859 0.566425
C  -3.417356 -0.71613 -1.045951
C  -3.379523 -1.208478 1.33271
C  -2.46585 -0.989598 -2.209112
C  -3.091839 -2.698587 1.30012
C  -1.541818 -2.171537 -1.967781
H  3.442173 0.570269 0.864045
H  3.258484 0.611025 -1.566857
H  1.668051 -0.109483 -1.517278
H  0.662817 -0.678374 0.950293
H  1.685272 -0.332817 2.322945
H  1.502416 2.320744 -1.852835
H  2.483711 2.622951 -0.424595
H  1.587806 2.085641 1.859842
H  -0.022023 1.412318 2.052451
H  -2.249356 1.835239 -1.35317
H  -1.740272 3.206681 1.250401
H  -1.91051 3.935917 -0.350845
H  4.273281 -2.904315 1.642963
H  4.505731 -1.222631 2.111671
H  2.970648 -2.028848 2.426353
H  1.875902 -2.261262 -1.170216
H  1.446441 -2.668291 0.490473
H  2.768963 -3.501531 -0.306381
H  5.212879 -0.697748 -0.34209
H  5.029384 -2.434268 -0.568096
H  4.221373 -1.323974 -1.659829
H  -3.607904 1.445333 0.614617
H  -2.202301 0.996858 1.570121
H  -4.074826 -1.584213 -0.948001
H  -4.081716 0.120534 -1.30804
H  -2.979385 -0.810872 2.268145
H  -4.46869 -1.043795 1.377276
H  -1.871189 -0.105311 -2.443578
H  -3.078467 -1.177847 -3.095965
H  -2.019048 -2.891059 1.34972
H  -3.558658 -3.1858 2.157969
H  -3.48005 -3.184866 0.40431
H  -2.103394 -3.092432 -1.799282
H  -0.908574 -2.007229 -1.096355
H  -0.886387 -2.341737 -2.823541
elementType: O N C H
totalener: -912.31093341 hartree
nucrepener: 1976.42640276 hartree
electener: -2888.73733617 hartree
oneelecener: -5166.88270014 hartree
twoeener: 2278.14536397 hartree
cpcmener: -0.01778319 hartree
kineticenergy: 907.79735019 hartree
xcener: -92.071664917499 hartree
chargesum: 0.0000000
charge: -0.394410 -0.387144 -0.207020 0.103711 0.542932 -0.215948 -0.241660 0.261860 -0.264108 -0.263369 0.212203 -0.002937 -0.357804 -0.390745 -0.355769 -0.213003 -0.117926 -0.052942 -0.089666 -0.267952 -0.259565 0.058229 0.086236 0.076802 0.053816 0.088355 0.076533 0.083986 0.088093 0.092751 0.090735 0.079108 0.095881 0.094593 0.096288 0.094773 0.094659 0.095535 0.102699 0.097764 0.094486 0.093766 0.094591 0.087992 0.097658 0.085847 0.077986 0.071181 0.060592 0.072019 0.076207 0.096317 0.080829 0.085789 0.037571 0.101596
qa: -0.3944 -0.3871 -0.2070 0.1037 0.5429 -0.2159 -0.2417 0.2619 -0.2641 -0.2634 0.2122 -0.0029 -0.3578 -0.3907 -0.3558 -0.2130 -0.1179 -0.0529 -0.0897 -0.2680 -0.2596 0.0582 0.0862 0.0768 0.0538 0.0884 0.0765 0.0840 0.0881 0.0928 0.0907 0.0791 0.0959 0.0946 0.0963 0.0948 0.0947 0.0955 0.1027 0.0978 0.0945 0.0938 0.0946 0.0880 0.0977 0.0858 0.0780 0.0712 0.0606 0.0720 0.0762 0.0963 0.0808 0.0858 0.0376 0.1016
va: 1.9805 2.0117 2.7853 3.6752 3.8404 3.9297 3.9724 3.6708 4.0392 3.9844 3.7796 4.0057 3.9224 3.9556 3.9241 3.9872 3.8933 3.8779 3.8350 3.9252 3.9230 1.0160 1.0124 1.0121 1.0276 1.0141 1.0313 1.0164 1.0218 1.0148 0.9877 0.9978 0.9930 1.0063 1.0035 1.0008 0.9997 0.9941 1.0080 1.0027 1.0078 0.9972 1.0106 0.9984 0.9957 1.0119 0.9960 1.0046 1.0123 1.0147 1.0046 1.0112 1.0019 1.0040 1.0175 1.0057
dispcorr: -0.031948601 hartree
energy: -912.342882009866
dipole: 3.01723 -3.89538 -0.87816 -19.02170 19.04413 0.02243 1.03584 -0.53904 0.49680
magnitude: 1.00919 au
magnitude: 2.56517 debye
