program: Orca
programVersion: 5.0.2
elementType: O O N C C C C C C C C C C C C C C C C C C H H H H H H H H H H H H H H H H H H H H H H H H H H H H H H H H H H H
charge: 0
multiplicity: 1
keywords: wb97x-d3
keywords: def2-TZVPP
keywords: def2/J RIJCOSX
keywords: DEFGRID2
keywords: scfconv7
keywords: smallprint printgap noloewdin
keywords: NOSOSCF
formula: C18H35NO2
InChI: InChI=1/C18H35NO2/c1-6-12-19(7-2)13-16-14-20-18(21-16)10-8-15(9-11-18)17(3,4)5/h15-16H,6-14H2,1-5H3
56 atoms
O  -0.425013 0.839281 0.203995
O  -0.101581 3.067001 -0.038045
N  -2.954931 -0.66827 0.28608
C  3.08289 0.211093 -0.057727
C  0.573511 1.82129 0.022119
C  2.113978 0.278385 -1.243059
C  2.313507 0.46271 1.243561
C  3.949053 -1.076584 -0.029279
C  1.329677 1.587523 -1.278601
C  1.52987 1.77182 1.203233
C  -1.68757 1.404455 -0.097568
C  -1.466573 2.862284 0.26206
C  3.105259 -2.342035 0.138649
C  4.75077 -1.191515 -1.329938
C  4.952373 -0.998208 1.126173
C  -2.761605 0.709024 0.710976
C  -4.009213 -0.800433 -0.706221
C  -3.100716 -1.591649 1.400318
C  -3.819474 -1.989328 -1.638362
C  -1.784964 -1.871716 2.107628
C  -4.977321 -2.131517 -2.614532
H  3.789205 1.046858 -0.175818
H  2.653608 0.177583 -2.186282
H  1.411249 -0.559422 -1.202537
H  1.624991 -0.364314 1.442579
H  2.997019 0.501249 2.093267
H  0.629034 1.586659 -2.119121
H  2.015845 2.425041 -1.439981
H  2.226217 2.611835 1.117728
H  0.973561 1.912174 2.135023
H  -1.906943 1.307779 -1.171001
H  -1.676287 3.048684 1.324058
H  -2.076401 3.545813 -0.330718
H  2.396208 -2.47831 -0.680288
H  3.746414 -3.226806 0.15684
H  2.536452 -2.340803 1.070394
H  4.117396 -1.376104 -2.198732
H  5.460087 -2.020502 -1.272387
H  5.326257 -0.283147 -1.527124
H  5.652433 -1.835938 1.08561
H  5.541403 -0.078434 1.082915
H  4.470279 -1.035812 2.103918
H  -3.691191 1.292842 0.644221
H  -2.466757 0.740808 1.762749
H  -5.005514 -0.853724 -0.233761
H  -4.019429 0.105265 -1.319284
H  -3.848073 -1.238501 2.129549
H  -3.486276 -2.536805 1.014564
H  -3.717499 -2.914941 -1.065373
H  -2.881264 -1.860394 -2.184784
H  -1.351515 -0.976445 2.554991
H  -1.935582 -2.593362 2.910974
H  -1.051961 -2.286697 1.414397
H  -4.821601 -2.96477 -3.300682
H  -5.10466 -1.230428 -3.21842
H  -5.919003 -2.310702 -2.091485
elementType: O N C H
totalener: -912.31591708 hartree
nucrepener: 1906.23379949 hartree
electener: -2818.54971657 hartree
oneelecener: -5026.45391260 hartree
twoeener: 2207.90419603 hartree
cpcmener: -0.01817896 hartree
kineticenergy: 907.78920215 hartree
xcener: -92.065462756472 hartree
chargesum: 0.0000000
charge: -0.393490 -0.401467 -0.245526 0.092861 0.585579 -0.232814 -0.233520 0.260703 -0.274950 -0.263514 0.127332 0.028069 -0.374997 -0.359457 -0.359808 -0.124669 -0.085160 -0.048300 -0.068129 -0.267798 -0.280399 0.057388 0.086220 0.078266 0.078456 0.088267 0.081142 0.084776 0.080408 0.080984 0.066381 0.069166 0.095373 0.096862 0.098170 0.094462 0.094270 0.094984 0.098482 0.094628 0.098048 0.094399 0.100903 0.094761 0.073954 0.085260 0.071147 0.085877 0.057141 0.049601 0.076332 0.091966 0.072793 0.091147 0.078941 0.078500
qa: -0.3935 -0.4015 -0.2455 0.0929 0.5856 -0.2328 -0.2335 0.2607 -0.2749 -0.2635 0.1273 0.0281 -0.3750 -0.3595 -0.3598 -0.1247 -0.0852 -0.0483 -0.0681 -0.2678 -0.2804 0.0574 0.0862 0.0783 0.0785 0.0883 0.0811 0.0848 0.0804 0.0810 0.0664 0.0692 0.0954 0.0969 0.0982 0.0945 0.0943 0.0950 0.0985 0.0946 0.0980 0.0944 0.1009 0.0948 0.0740 0.0853 0.0711 0.0859 0.0571 0.0496 0.0763 0.0920 0.0728 0.0911 0.0789 0.0785
va: 1.9936 2.0022 2.8044 3.6853 3.7618 3.9334 3.9529 3.6761 4.0465 4.0478 3.9805 3.9793 3.9472 3.9218 3.9238 3.8728 3.9123 3.8742 3.8557 3.9301 3.9514 1.0166 1.0139 1.0206 1.0072 1.0127 1.0172 1.0183 1.0208 1.0205 1.0068 0.9957 0.9944 1.0005 1.0046 1.0007 0.9994 1.0070 1.0027 1.0073 1.0028 0.9989 1.0073 1.0084 1.0049 0.9978 1.0055 0.9926 1.0129 1.0189 1.0054 1.0118 1.0123 1.0040 1.0005 1.0016
dispcorr: -0.028478933 hartree
energy: -912.344396013665
dipole: 2.20360 -3.02135 -0.81774 -16.09742 16.07458 -0.02284 -1.08021 1.20629 0.12608
magnitude: 0.82772 au
magnitude: 2.10389 debye
