program: Gaussian 09
title: 000068586
version: EM64L-G09RevD.01
frameworkgroup: C1[X(C22H28O2)]
method: RPBEPBE
basis: SDD
operation: Freq
keyword: #pfreq=noraman
keyword: PBEPBE/SDD
title: #p freq=noraman PBEPBE/SDD
converged: YES YES NO NO
title: Mulliken charges:
elementType: O O C C C C C C C C C C C C C C C C C C C C C C H H H H H H H H H H H H H H H H H H H H H H H H H H H H
charge: -0.441476 -0.438353 0.340866 -0.172395 -0.114370 -0.186788 -0.618538 -0.040629 0.042649 -0.538218 -0.510568 -0.508435 -0.790007 0.245274 -0.410374 -0.603144 0.331938 0.224015 -0.365644 -0.724795 -0.603858 -0.413264 0.291840 -0.548488 0.235625 0.233414 0.204407 0.229921 0.209245 0.176772 0.217044 0.227144 0.247588 0.238224 0.219358 0.218026 0.211591 0.249159 0.216850 0.208353 0.235533 0.222504 0.224047 0.338353 0.233568 0.217883 0.208914 0.218349 0.224164 0.249425 0.286177 0.351126
chargesum: 0.00000
title: Mulliken charges with hydrogens summed into heavy atoms:
elementType: O O C C C C C C C C C C C C C C C C C C C C C C
charge: -0.103123 -0.087227 0.340866 0.063230 0.119045 0.017618 -0.179372 0.136143 0.042649 -0.094030 -0.024756 -0.071051 -0.112407 0.245274 0.033512 -0.156593 0.331938 0.224015 -0.132077 -0.079650 -0.379694 -0.163839 0.291840 -0.262311
polarizability: 2.88854923e+02 4.91883171e-01 2.16371919e+02 -4.62397086e+00 1.59546543e+01 1.94266861e+02
1716.lowfreq: -8.8769 -3.3512 -0.0003 0.0004 0.0006 11.0077 37.2221 53.9004 56.1921
frequency: 37.1785 53.7835 56.1234 69.9661 101.4291 109.7385 123.9496 136.5275 158.9949 176.6880 187.3243 201.9431 216.6433 227.2223 234.7884 253.8892 258.6534 283.9533 295.6825 300.9691 324.1083 337.2389 352.4898 357.4615 372.2876 387.5840 396.6228 436.0622 441.7355 446.4862 458.2941 471.0298 486.5040 526.8477 533.7280 555.3162 579.0418 597.8645 607.8697 623.1207 636.2121 648.4775 655.4534 708.3630 723.9758 726.0769 752.2098 782.2698 793.9936 809.4819 826.5384 832.8701 857.8523 866.2388 879.3463 898.7999 916.6544 924.1182 949.8152 954.9846 959.9130 978.1121 985.1337 993.7227 1012.3816 1023.9714 1035.8392 1042.3201 1052.5349 1062.2627 1081.2301 1103.4934 1107.9856 1122.9341 1129.5171 1134.1992 1138.9509 1161.4878 1165.6558 1177.3583 1183.4059 1201.8259 1207.5964 1216.3092 1218.6508 1242.6310 1250.1830 1256.8884 1263.9229 1271.3496 1273.8222 1277.8880 1287.9598 1292.6709 1300.1956 1308.6062 1322.3029 1328.8145 1335.9240 1338.3089 1346.7575 1357.6068 1362.8115 1377.2511 1384.1677 1387.1082 1404.1782 1427.6076 1455.5846 1461.8326 1462.9272 1469.5287 1470.9462 1475.1354 1481.0013 1490.7471 1495.7692 1500.1740 1501.4580 1600.5423 1619.5356 2118.0357 2896.6243 2916.0067 2942.0463 2953.8704 2959.5308 2971.5582 2972.4935 2975.2487 2998.1632 2998.9859 3006.6563 3018.4343 3022.9227 3030.9284 3036.9050 3041.9911 3057.5597 3068.2673 3075.7975 3091.8150 3091.9003 3096.6273 3107.8922 3130.1971 3169.1345 3426.6112 3545.3192 3579.8663
redmass: 5.3292 3.5159 2.3848 4.2519 3.6868 2.5588 4.3475 1.9717 3.6754 2.8103 2.3726 1.8283 3.9683 1.9641 2.0751 2.3007 2.8430 1.3783 2.1470 3.1992 3.8896 2.6785 1.1318 3.3536 2.5291 2.8579 3.4831 2.9208 4.1509 3.3095 3.8076 4.0115 3.2377 3.9683 4.3830 3.0211 4.7134 3.9868 4.5425 1.3729 2.9555 2.8714 1.2427 3.5603 3.3425 2.9450 2.2151 2.2609 1.7141 1.7654 1.6258 1.5977 1.8384 2.1128 2.1895 2.1486 2.5718 2.2214 1.8283 1.4281 2.6621 3.5735 1.7032 2.6223 2.5275 1.7927 2.4278 2.1860 2.0388 1.9864 2.2682 1.8120 1.8262 2.5232 1.9669 1.6903 2.1969 1.5738 2.2019 1.4267 1.3586 2.0595 2.0350 1.3559 1.5074 1.4399 1.3784 1.7751 1.5292 1.4383 1.3517 1.5123 1.5310 1.4384 1.5999 1.3636 1.3779 1.3363 1.4915 1.4673 1.4817 1.6079 1.3824 1.6333 3.0772 1.2256 1.1902 3.4150 1.1210 1.0715 1.0661 1.0927 1.0507 1.0710 1.0662 1.0538 1.0761 2.7048 1.0833 6.7125 6.6375 6.0720 1.0804 1.0800 1.0801 1.0651 1.0773 1.0505 1.0643 1.0501 1.0615 1.0608 1.0383 1.0941 1.1007 1.0620 1.1010 1.0969 1.1021 1.0986 1.0998 1.0914 1.0984 1.1029 1.0977 1.0880 1.0954 1.1576 1.0660 1.0660
irintensity: 0.1291 0.6608 0.1358 0.3574 0.2194 0.2552 0.8371 0.3962 0.2959 1.9560 2.3227 0.2855 0.1331 0.7650 0.1964 0.3572 2.8368 87.9370 48.4102 13.4501 0.9019 1.0278 141.5310 0.7168 1.2795 1.0421 13.5502 7.6865 16.4138 11.0051 14.1623 2.7711 7.2451 0.8082 0.8667 4.4165 3.5598 1.7630 1.1537 58.3194 11.2850 16.8936 60.0263 4.5333 6.6091 1.1034 0.9391 3.2280 9.8028 2.7619 17.4509 2.4674 31.6030 4.3095 10.0438 7.1178 17.8898 10.0307 14.7529 2.6672 28.6138 70.9747 1.8568 18.4681 7.8228 9.0204 4.3216 4.0318 8.2023 1.6481 2.1067 2.8484 5.6133 5.5333 23.9514 207.5573 31.9114 15.9936 8.2519 16.7286 7.2932 1.3731 2.9286 1.5079 5.0724 6.4504 7.2221 24.5906 6.3034 37.5257 1.4960 4.1255 3.0571 6.3243 19.6582 4.3608 2.0515 2.3139 9.6853 0.2057 0.8028 2.2756 0.9450 8.9641 7.3366 14.9062 21.5273 38.6394 9.8290 3.6616 5.7984 6.0241 1.8585 13.7713 15.1815 4.8869 13.2956 76.7676 14.0869 11.4180 65.4767 2.8093 16.2806 12.8980 24.1010 28.2937 7.7328 6.4931 60.6357 62.1916 16.3803 31.4740 26.2834 43.3976 31.8726 24.7825 49.0978 10.3589 22.0823 48.6598 76.1592 18.8151 36.9380 23.7543 26.2766 12.9932 9.6250 69.0157 8.0462 37.2855
temp: 298.150 k
press: 1.00000 atm
elementType: 8 8 6 6 6 6 6 6 6 6 6 6 6 6 6 6 6 6 6 6 6 6 6 6 1 1 1 1 1 1 1 1 1 1 1 1 1 1 1 1 1 1 1 1 1 1 1 1 1 1 1 1
symmnumber: 1
zpe: 1163985.6 jmol-1
zpe.correction: 0.443339 hartree
zpe.thermalcorrener: 0.466261 hartree
zpe.thermalcorrenthalpy: 0.467205 hartree
zpe.thermalcorrgfe: 0.393540 hartree
zpe.sumelectzpe: -1003.718575 hartree
zpe.sumelectthermal: -1003.695654 hartree
zpe.sumelectthermalent: -1003.694709 hartree
zpe.sumelectthermalfe: -1003.768374 hartree
dipole: 0.5440 -1.2644 -0.1541
dipole: 1.3850
quadrupole: -157.3608 -136.4022 -140.8710
quadrupole: -12.4046 -10.7640 4.8393
quadrupole: -12.4828 8.4758 4.0070 -12.4046 -10.7640 4.8393
hfenergy: -1004.161914 hartree
pointgroup: C01 [X(C22H28O2)]
dipole: -0.2109237 0.4995967 -0.0533646 debye
polarizability: 288.9938701|-0.4389812|216.5789078|2.697082|-15.8397568|193.9209241 unknown
InChI: InChI=1S/C22H28O2/c1-4-14-13-21(3)19(10-11-22(21,24)5-2)18-8-6-15-12-16(23)7-9-17(15)20(14)18/h2,7,9,12,14,18-20,23-24H,4,6,8,10-11,13H2,1,3H3
charge 0 multiplicity 1
52 atoms
O  4.854176 -0.740948 -0.437252
O  -6.380535 0.018429 0.459163
C  2.312278 -0.309759 -0.37166
C  1.582631 1.046812 -0.124415
C  0.089544 0.998014 -0.499121
C  -0.585022 -0.070539 0.419076
C  1.592365 -1.427146 0.424569
C  0.041152 -1.496579 0.211024
C  3.767143 0.090392 0.13407
C  2.529138 2.094898 -0.762224
C  3.958666 1.540106 -0.448929
C  -0.627053 2.355721 -0.345994
C  2.442343 -0.66508 -1.878534
C  -2.120821 -0.029581 0.367241
C  -0.442558 -2.196707 -1.092198
C  -2.081761 2.241712 -0.843547
C  -2.822693 1.069278 -0.206331
C  3.885599 0.079223 1.609485
C  -2.886029 -1.062728 0.973842
C  0.093171 -3.634549 -1.269405
C  -4.239934 1.091623 -0.181438
C  -4.291896 -1.045661 1.002382
C  -4.972354 0.041155 0.410578
C  4.038368 0.052644 2.833311
H  1.616839 1.221753 0.976015
H  -0.020029 0.692917 -1.561859
H  -0.302902 0.221239 1.459027
H  1.76252 -1.241152 1.504342
H  2.03789 -2.416484 0.201385
H  -0.3266 -2.139137 1.040862
H  2.377554 3.103104 -0.339107
H  2.359531 2.166018 -1.85321
H  4.58453 1.45316 -1.353591
H  4.501996 2.177186 0.26769
H  -0.096019 3.137273 -0.922153
H  -0.611907 2.666342 0.71925
H  1.477958 -0.575165 -2.403214
H  3.171176 -0.020088 -2.395424
H  2.798618 -1.702743 -1.998628
H  -0.188464 -1.600149 -1.986802
H  -1.548256 -2.233094 -1.060961
H  -2.072479 2.11347 -1.946733
H  -2.634949 3.180364 -0.646688
H  4.876148 -1.608161 0.044103
H  -2.369863 -1.90724 1.443886
H  1.182739 -3.652263 -1.452467
H  -0.106934 -4.246672 -0.368674
H  -0.394544 -4.132427 -2.127675
H  -4.768314 1.948935 -0.623482
H  -4.868432 -1.847939 1.471809
H  4.169882 0.038336 3.899567
H  -6.757709 0.819487 0.017838
