program: Orca
programVersion: 5.0.2
elementType: O O N C C C C C C C C C C C C C C C C C C H H H H H H H H H H H H H H H H H H H H H H H H H H H H H H H H H H H
charge: 0
multiplicity: 1
keywords: wb97x-d3
keywords: def2-TZVPP
keywords: def2/J RIJCOSX
keywords: DEFGRID2
keywords: scfconv7
keywords: smallprint printgap noloewdin
keywords: NOSOSCF
formula: C18H35NO2
InChI: InChI=1/C18H35NO2/c1-6-12-19(7-2)13-16-14-20-18(21-16)10-8-15(9-11-18)17(3,4)5/h15-16H,6-14H2,1-5H3
56 atoms
O  -0.432011 0.649057 -1.051661
O  -0.778828 2.331621 0.405364
N  -3.02139 -0.066918 0.044848
C  2.825083 0.048893 0.352803
C  0.170792 1.372188 0.009539
C  2.519997 0.970666 -0.833005
C  1.521788 -0.59029 0.839903
C  3.958961 -0.975731 0.085172
C  1.462989 2.017046 -0.484272
C  0.465201 0.453071 1.181499
C  -1.601581 1.309585 -1.500138
C  -1.56933 2.626523 -0.724864
C  3.598935 -1.967257 -1.022678
C  5.239787 -0.235826 -0.312554
C  4.258721 -1.761738 1.365978
C  -2.832276 0.42677 -1.304693
C  -3.2504 -1.500567 0.10828
C  -3.985861 0.68141 0.83757
C  -2.00957 -2.339758 -0.168166
C  -3.609658 0.745873 2.308726
C  -2.322923 -3.828037 -0.173653
H  3.189302 0.691558 1.168588
H  3.420919 1.493902 -1.158259
H  2.18077 0.382814 -1.691419
H  1.128359 -1.271655 0.079409
H  1.697729 -1.197196 1.729925
H  1.263384 2.653061 -1.352256
H  1.847232 2.670632 0.305364
H  0.817043 1.065689 2.017689
H  -0.459921 -0.029508 1.505124
H  -1.517539 1.511819 -2.57444
H  -2.54938 2.97243 -0.395649
H  -1.122676 3.42548 -1.329231
H  3.411542 -1.472321 -1.977601
H  4.418174 -2.672417 -1.18354
H  2.713939 -2.557906 -0.778519
H  5.504899 0.527024 0.424375
H  5.155891 0.256673 -1.282282
H  6.080883 -0.92975 -0.380654
H  5.142263 -2.390671 1.233042
H  4.457437 -1.094107 2.20864
H  3.440726 -2.423089 1.655449
H  -2.731115 -0.419377 -1.989911
H  -3.707173 0.984011 -1.669778
H  -3.603243 -1.745353 1.113667
H  -4.059996 -1.810561 -0.575876
H  -4.045658 1.700779 0.45383
H  -5.001347 0.266726 0.730824
H  -1.255489 -2.121412 0.592889
H  -1.565825 -2.064376 -1.128559
H  -2.670197 1.283613 2.443845
H  -4.380564 1.267879 2.879318
H  -3.494881 -0.245745 2.750488
H  -3.04081 -4.082359 -0.956141
H  -2.747156 -4.15398 0.778496
H  -1.424726 -4.421219 -0.350906
elementType: O N C H
totalener: -912.31013347 hartree
nucrepener: 1961.30746367 hartree
electener: -2873.61759714 hartree
oneelecener: -5136.97804565 hartree
twoeener: 2263.36044851 hartree
cpcmener: -0.01697744 hartree
kineticenergy: 907.78942138 hartree
xcener: -92.070114195656 hartree
chargesum: -0.0000000
charge: -0.428782 -0.403845 -0.217492 0.110097 0.601209 -0.235277 -0.258717 0.263437 -0.271135 -0.297115 0.222892 -0.027707 -0.376923 -0.358395 -0.361965 -0.158666 -0.099153 -0.064286 -0.075249 -0.264921 -0.284727 0.057028 0.087845 0.077516 0.084087 0.091144 0.082170 0.079598 0.097397 0.075131 0.082186 0.105250 0.092042 0.096877 0.097833 0.094755 0.098993 0.093091 0.094436 0.094764 0.098873 0.094243 0.092351 0.091238 0.090919 0.071538 0.083469 0.075822 0.047922 0.059186 0.068810 0.094975 0.083404 0.080677 0.080242 0.090910
qa: -0.4288 -0.4038 -0.2175 0.1101 0.6012 -0.2353 -0.2587 0.2634 -0.2711 -0.2971 0.2229 -0.0277 -0.3769 -0.3584 -0.3620 -0.1587 -0.0992 -0.0643 -0.0752 -0.2649 -0.2847 0.0570 0.0878 0.0775 0.0841 0.0911 0.0822 0.0796 0.0974 0.0751 0.0822 0.1053 0.0920 0.0969 0.0978 0.0948 0.0990 0.0931 0.0944 0.0948 0.0989 0.0942 0.0924 0.0912 0.0909 0.0715 0.0835 0.0758 0.0479 0.0592 0.0688 0.0950 0.0834 0.0807 0.0802 0.0909
va: 1.9780 1.9776 2.8396 3.6754 3.7477 3.9410 3.9765 3.6692 4.0887 4.0135 3.8104 3.9598 3.9463 3.9239 3.9238 3.9347 3.9085 3.8839 3.8574 3.9100 3.9730 1.0175 1.0127 1.0218 1.0021 1.0119 1.0128 1.0205 1.0205 1.0355 1.0018 0.9975 0.9964 1.0004 1.0046 1.0013 1.0025 0.9997 1.0072 1.0069 1.0028 0.9997 1.0031 1.0085 0.9947 1.0040 0.9964 1.0039 1.0091 1.0178 1.0169 1.0123 1.0014 1.0026 0.9997 1.0033
dispcorr: -0.031483760 hartree
energy: -912.341617228483
dipole: 5.72612 -6.24858 -0.52246 -13.27442 13.50877 0.23436 3.03845 -3.60669 -0.56824
magnitude: 0.80672 au
magnitude: 2.05051 debye
