program: Orca
programVersion: 5.0.2
elementType: O O N C C C C C C C C C C C C C C C C C C H H H H H H H H H H H H H H H H H H H H H H H H H H H H H H H H H H H
charge: 0
multiplicity: 1
keywords: wb97x-d3
keywords: def2-TZVPP
keywords: def2/J RIJCOSX
keywords: DEFGRID2
keywords: scfconv7
keywords: smallprint printgap noloewdin
keywords: NOSOSCF
formula: C18H35NO2
InChI: InChI=1/C18H35NO2/c1-6-12-19(7-2)13-16-14-20-18(21-16)10-8-15(9-11-18)17(3,4)5/h15-16H,6-14H2,1-5H3
56 atoms
O  -0.38916 0.528598 -0.557073
O  -0.372936 2.645751 0.242815
N  -3.425952 -0.331577 -0.062756
C  3.123109 0.190259 0.163953
C  0.447898 1.510274 0.019921
C  2.544937 0.724907 -1.150565
C  1.972943 -0.188946 1.103287
C  4.17386 -0.937604 -0.024927
C  1.578776 1.885325 -0.928745
C  1.011253 0.974904 1.327507
C  -1.561758 1.166504 -1.039601
C  -1.714881 2.296662 -0.039651
C  5.299184 -0.454239 -0.945792
C  4.803213 -1.288181 1.326973
C  3.563375 -2.206092 -0.624454
C  -2.713189 0.176837 -1.209149
C  -2.677399 -1.094203 0.916474
C  -4.425651 0.545196 0.525073
C  -2.001991 -2.341979 0.362134
C  -5.739122 -0.174867 0.789163
C  -2.973021 -3.341111 -0.247238
H  3.660437 1.025666 0.637378
H  3.343104 1.071561 -1.809078
H  2.030632 -0.076722 -1.68961
H  1.422603 -1.043853 0.699089
H  2.356077 -0.506354 2.074651
H  1.164677 2.221319 -1.884326
H  2.120247 2.736563 -0.503752
H  1.540142 1.790316 1.830416
H  0.191852 0.671493 1.986247
H  -1.367023 1.589933 -2.037417
H  -2.233956 1.977219 0.869939
H  -2.23656 3.163765 -0.448227
H  5.72243 0.492794 -0.600796
H  6.112354 -1.183589 -0.971475
H  4.968462 -0.313221 -1.975779
H  5.616842 -2.006011 1.198533
H  4.089903 -1.73912 2.018259
H  5.221959 -0.403972 1.814612
H  4.333842 -2.966493 -0.773487
H  2.803185 -2.64618 0.023451
H  3.102414 -2.023595 -1.597048
H  -2.326306 -0.66095 -1.799163
H  -3.444738 0.662266 -1.860507
H  -1.93071 -0.483037 1.44612
H  -3.385322 -1.419123 1.685232
H  -4.071019 1.000779 1.460519
H  -4.612705 1.378026 -0.156737
H  -1.46426 -2.812871 1.18989
H  -1.236337 -2.074311 -0.369575
H  -5.605949 -1.02956 1.454914
H  -6.460525 0.495577 1.260232
H  -6.177612 -0.540636 -0.140385
H  -3.490774 -2.930847 -1.114987
H  -3.733874 -3.644331 0.475454
H  -2.45453 -4.244113 -0.573683
elementType: O N C H
totalener: -912.30981202 hartree
nucrepener: 1931.29662685 hartree
electener: -2843.60643887 hartree
oneelecener: -5076.13870728 hartree
twoeener: 2232.53226842 hartree
cpcmener: -0.01506003 hartree
kineticenergy: 907.77836366 hartree
xcener: -92.070782257842 hartree
chargesum: 0.0000000
charge: -0.411243 -0.407132 -0.207211 0.094518 0.589174 -0.229728 -0.237300 0.262085 -0.274380 -0.278278 0.143521 -0.000666 -0.358374 -0.359317 -0.378357 -0.133166 -0.102838 -0.058108 -0.094678 -0.272552 -0.284020 0.057024 0.085783 0.077572 0.082515 0.088221 0.081086 0.084075 0.087570 0.091410 0.067491 0.087432 0.100978 0.099727 0.094472 0.093592 0.095078 0.094235 0.097665 0.097836 0.093977 0.099120 0.092531 0.103097 0.077318 0.101475 0.069604 0.085293 0.073212 0.050419 0.077350 0.086022 0.074941 0.075628 0.079624 0.094680
qa: -0.4112 -0.4071 -0.2072 0.0945 0.5892 -0.2297 -0.2373 0.2621 -0.2744 -0.2783 0.1435 -0.0007 -0.3584 -0.3593 -0.3784 -0.1332 -0.1028 -0.0581 -0.0947 -0.2726 -0.2840 0.0570 0.0858 0.0776 0.0825 0.0882 0.0811 0.0841 0.0876 0.0914 0.0675 0.0874 0.1010 0.0997 0.0945 0.0936 0.0951 0.0942 0.0977 0.0978 0.0940 0.0991 0.0925 0.1031 0.0773 0.1015 0.0696 0.0853 0.0732 0.0504 0.0773 0.0860 0.0749 0.0756 0.0796 0.0947
va: 1.9734 1.9950 2.8223 3.6782 3.7481 3.9295 3.9536 3.6734 4.0574 4.0244 3.8591 3.9877 3.9218 3.9234 3.9470 3.9780 3.9310 3.8841 3.8337 3.9562 3.9489 1.0166 1.0141 1.0191 1.0019 1.0137 1.0159 1.0189 1.0226 1.0138 1.0106 0.9940 0.9964 1.0021 1.0073 0.9985 1.0064 1.0000 1.0032 1.0050 1.0009 1.0002 0.9940 0.9992 1.0148 0.9894 0.9941 0.9932 1.0098 1.0199 1.0032 1.0110 1.0099 1.0087 1.0012 1.0053
dispcorr: -0.030748940 hartree
energy: -912.340560956088
dipole: 3.31733 -3.54503 -0.22770 -13.62576 13.82273 0.19698 1.72107 -1.82132 -0.10025
magnitude: 0.31733 au
magnitude: 0.80659 debye
