program: Orca
programVersion: 5.0.2
elementType: O O N C C C C C C C C C C C C C C C C C C H H H H H H H H H H H H H H H H H H H H H H H H H H H H H H H H H H H
charge: 0
multiplicity: 1
keywords: wb97x-d3
keywords: def2-TZVPP
keywords: def2/J RIJCOSX
keywords: DEFGRID2
keywords: scfconv7
keywords: smallprint printgap noloewdin
keywords: NOSOSCF
formula: C18H35NO2
InChI: InChI=1/C18H35NO2/c1-6-12-19(7-2)13-16-14-20-18(21-16)10-8-15(9-11-18)17(3,4)5/h15-16H,6-14H2,1-5H3
56 atoms
O  0.001547 0.369117 -0.726898
O  -0.324699 1.852382 0.947217
N  -3.608616 -0.154648 -0.115745
C  3.538433 0.302602 0.06334
C  0.671742 1.104348 0.289434
C  2.863373 1.212043 -0.968306
C  2.480598 -0.624159 0.671186
C  4.792381 -0.434737 -0.477575
C  1.718001 2.009518 -0.351269
C  1.324523 0.159778 1.286598
C  -1.38086 0.690859 -0.717702
C  -1.409525 1.998696 0.053602
C  4.469718 -1.313753 -1.687278
C  5.856751 0.590172 -0.882352
C  5.398713 -1.312961 0.621702
C  -2.183749 -0.418875 -0.042215
C  -4.329327 -0.562006 1.078845
C  -4.191442 -0.61643 -1.365633
C  -4.395522 -2.061562 1.368732
C  -5.58028 -0.061758 -1.628515
C  -5.080308 -2.342031 2.697702
H  3.898975 0.950052 0.876898
H  3.579687 1.914596 -1.39788
H  2.482788 0.614873 -1.80249
H  2.095368 -1.309119 -0.090853
H  2.915273 -1.249432 1.452493
H  1.247988 2.647501 -1.105673
H  2.1153 2.673063 0.42319
H  1.698884 0.751825 2.127729
H  0.571852 -0.524142 1.689267
H  -1.712811 0.827073 -1.751052
H  -2.328146 2.142351 0.623359
H  -1.278243 2.863601 -0.607716
H  4.113991 -0.73081 -2.538753
H  5.362213 -1.850493 -2.018511
H  3.710481 -2.064881 -1.460363
H  5.546341 1.211145 -1.723806
H  6.780003 0.088794 -1.182332
H  6.103946 1.257882 -0.052795
H  5.581685 -0.742489 1.536219
H  4.763398 -2.160738 0.882215
H  6.357812 -1.724062 0.298049
H  -1.886156 -0.470056 1.009154
H  -1.906519 -1.385882 -0.488205
H  -3.86092 -0.058957 1.930809
H  -5.346643 -0.163081 1.030696
H  -3.538019 -0.29124 -2.178591
H  -4.21836 -1.715398 -1.432449
H  -3.385831 -2.483299 1.38469
H  -4.9319 -2.578484 0.568176
H  -5.584223 1.028393 -1.580444
H  -5.914115 -0.352883 -2.625321
H  -6.323761 -0.432758 -0.921952
H  -5.137085 -3.412281 2.900896
H  -6.100448 -1.952419 2.712334
H  -4.541555 -1.880247 3.527953
elementType: O N C H
totalener: -912.31538993 hartree
nucrepener: 1864.47002232 hartree
electener: -2776.78541225 hartree
oneelecener: -4942.47062619 hartree
twoeener: 2165.68521394 hartree
cpcmener: -0.01506144 hartree
kineticenergy: 907.78695969 hartree
xcener: -92.068654762921 hartree
chargesum: 0.0000000
charge: -0.431628 -0.402765 -0.230111 0.084343 0.563537 -0.227017 -0.222408 0.260821 -0.275588 -0.278253 0.249889 -0.005927 -0.372934 -0.356603 -0.361422 -0.200297 -0.110703 -0.066130 -0.081105 -0.266870 -0.280746 0.056698 0.088511 0.078857 0.078193 0.086263 0.083225 0.079030 0.088685 0.085935 0.093524 0.092508 0.085395 0.094989 0.097218 0.097660 0.094191 0.094541 0.097104 0.099387 0.094127 0.094882 0.101552 0.089322 0.081980 0.093551 0.086896 0.066040 0.065466 0.061516 0.077415 0.092062 0.083584 0.091489 0.080158 0.079962
qa: -0.4316 -0.4028 -0.2301 0.0843 0.5635 -0.2270 -0.2224 0.2608 -0.2756 -0.2783 0.2499 -0.0059 -0.3729 -0.3566 -0.3614 -0.2003 -0.1107 -0.0661 -0.0811 -0.2669 -0.2807 0.0567 0.0885 0.0789 0.0782 0.0863 0.0832 0.0790 0.0887 0.0859 0.0935 0.0925 0.0854 0.0950 0.0972 0.0977 0.0942 0.0945 0.0971 0.0994 0.0941 0.0949 0.1016 0.0893 0.0820 0.0936 0.0869 0.0660 0.0655 0.0615 0.0774 0.0921 0.0836 0.0915 0.0802 0.0800
va: 1.9907 1.9963 2.8542 3.6840 3.8001 3.9258 3.9281 3.6714 4.0790 4.0337 3.8376 3.9605 3.9457 3.9240 3.9253 3.9547 3.9701 3.9228 3.8296 3.9165 3.9555 1.0164 1.0131 1.0206 1.0193 1.0141 1.0149 1.0215 1.0176 1.0159 1.0036 1.0150 0.9943 0.9993 1.0048 1.0009 1.0014 1.0063 1.0033 1.0023 0.9984 1.0074 0.9991 1.0135 0.9979 0.9924 0.9889 0.9983 1.0087 1.0069 1.0133 1.0066 0.9974 1.0023 1.0007 1.0018
dispcorr: -0.028088032 hartree
energy: -912.343477961151
dipole: 0.84554 -1.24170 -0.39616 -10.15852 9.87619 -0.28233 -0.20904 -0.00758 -0.21662
magnitude: 0.53252 au
magnitude: 1.35356 debye
