program: Orca
programVersion: 5.0.2
elementType: O O N C C C C C C C C C C C C C C C C C C H H H H H H H H H H H H H H H H H H H H H H H H H H H H H H H H H H H
charge: 0
multiplicity: 1
keywords: wb97x-d3
keywords: def2-TZVPP
keywords: def2/J RIJCOSX
keywords: DEFGRID2
keywords: scfconv7
keywords: smallprint printgap noloewdin
keywords: NOSOSCF
formula: C18H35NO2
InChI: InChI=1/C18H35NO2/c1-6-12-19(7-2)13-16-14-20-18(21-16)10-8-15(9-11-18)17(3,4)5/h15-16H,6-14H2,1-5H3
56 atoms
O  -0.168506 0.617089 -0.748843
O  -0.355455 2.192133 0.839206
N  -3.658287 -0.520959 -0.21188
C  3.331978 0.222243 -0.007284
C  0.565374 1.310666 0.246744
C  2.740992 1.205213 -1.02368
C  2.194298 -0.587975 0.622598
C  4.489521 -0.638894 -0.58039
C  1.681553 2.10986 -0.400667
C  1.141464 0.319948 1.254903
C  -1.560772 0.750459 -0.497175
C  -1.613638 1.549715 0.803671
C  4.063541 -1.431092 -1.818383
C  5.664477 0.268267 -0.958116
C  4.989699 -1.622838 0.481295
C  -2.217203 -0.61945 -0.412653
C  -4.15027 -1.424428 0.819756
C  -4.406098 -0.711001 -1.447543
C  -3.77932 -1.018781 2.23779
C  -4.113485 0.308435 -2.531991
C  -4.410972 -1.942157 3.268366
H  3.774241 0.822453 0.802005
H  3.520584 1.838717 -1.451992
H  2.300109 0.656864 -1.862026
H  1.721972 -1.229774 -0.128236
H  2.575856 -1.254211 1.398236
H  1.26108 2.78216 -1.153771
H  2.145084 2.738335 0.366108
H  1.598054 0.887385 2.072547
H  0.343143 -0.28352 1.698177
H  -2.005011 1.332599 -1.310512
H  -1.756631 0.902058 1.676605
H  -2.398893 2.305881 0.811422
H  3.807959 -0.781574 -2.657563
H  4.875868 -2.079909 -2.15481
H  3.200541 -2.070929 -1.622576
H  6.000694 0.863281 -0.104811
H  5.418168 0.960077 -1.764954
H  6.516839 -0.324991 -1.297965
H  5.898823 -2.123559 0.139249
H  5.230921 -1.115728 1.419699
H  4.261727 -2.40433 0.704383
H  -1.758468 -1.162408 0.418701
H  -1.978395 -1.200234 -1.315055
H  -5.241797 -1.43399 0.752932
H  -3.828467 -2.464903 0.640968
H  -4.244053 -1.721681 -1.859847
H  -5.469097 -0.64896 -1.202088
H  -4.107385 0.010025 2.410127
H  -2.694007 -1.025347 2.371365
H  -4.789816 0.142985 -3.372564
H  -4.270476 1.328355 -2.177109
H  -3.098335 0.233195 -2.923431
H  -4.081881 -2.97518 3.137771
H  -5.500766 -1.933338 3.198917
H  -4.146895 -1.642403 4.283369
elementType: O N C H
totalener: -912.31404539 hartree
nucrepener: 1886.92127283 hartree
electener: -2799.23531822 hartree
oneelecener: -4987.20942480 hartree
twoeener: 2187.97410658 hartree
cpcmener: -0.01581690 hartree
kineticenergy: 907.78991781 hartree
xcener: -92.067194690943 hartree
chargesum: 0.0000000
charge: -0.428923 -0.390334 -0.236171 0.087043 0.584801 -0.218823 -0.237988 0.258339 -0.274058 -0.298381 0.221948 -0.020939 -0.371451 -0.355084 -0.362169 -0.180237 -0.086273 -0.061013 -0.064513 -0.268483 -0.287571 0.056078 0.089045 0.078240 0.079776 0.086552 0.078246 0.084626 0.085686 0.088814 0.092724 0.089759 0.102110 0.093604 0.097528 0.097940 0.096397 0.094232 0.094524 0.095386 0.099253 0.093808 0.106936 0.096340 0.079485 0.071668 0.061010 0.079172 0.055938 0.053671 0.097065 0.076938 0.085144 0.079352 0.081525 0.091715
qa: -0.4289 -0.3903 -0.2362 0.0870 0.5848 -0.2188 -0.2380 0.2583 -0.2741 -0.2984 0.2219 -0.0209 -0.3715 -0.3551 -0.3622 -0.1802 -0.0863 -0.0610 -0.0645 -0.2685 -0.2876 0.0561 0.0890 0.0782 0.0798 0.0866 0.0782 0.0846 0.0857 0.0888 0.0927 0.0898 0.1021 0.0936 0.0975 0.0979 0.0964 0.0942 0.0945 0.0954 0.0993 0.0938 0.1069 0.0963 0.0795 0.0717 0.0610 0.0792 0.0559 0.0537 0.0971 0.0769 0.0851 0.0794 0.0815 0.0917
va: 1.9852 2.0210 2.8475 3.6836 3.7808 3.9104 3.9407 3.6719 4.0652 4.0167 3.7770 3.9782 3.9473 3.9225 3.9271 3.9047 3.9271 3.9252 3.8270 3.9091 3.9666 1.0169 1.0138 1.0200 1.0186 1.0128 1.0287 1.0163 1.0222 1.0129 1.0003 1.0016 1.0016 0.9992 1.0047 1.0016 1.0035 1.0024 1.0061 1.0070 1.0022 0.9974 0.9931 1.0128 0.9978 1.0030 1.0044 0.9953 1.0168 1.0110 1.0078 1.0094 0.9979 1.0016 1.0009 1.0032
dispcorr: -0.028556485 hartree
energy: -912.342601874000
dipole: 2.98822 -3.44454 -0.45632 -11.51245 10.73314 -0.77931 0.04548 0.13835 0.18383
magnitude: 0.92160 au
magnitude: 2.34252 debye
