program: Orca
programVersion: 5.0.2
elementType: O O N C C C C C C C C C C C C C C C C C C H H H H H H H H H H H H H H H H H H H H H H H H H H H H H H H H H H H
charge: 0
multiplicity: 1
keywords: wb97x-d3
keywords: def2-TZVPP
keywords: def2/J RIJCOSX
keywords: DEFGRID2
keywords: scfconv7
keywords: smallprint printgap noloewdin
keywords: NOSOSCF
formula: C18H35NO2
InChI: InChI=1/C18H35NO2/c1-6-12-19(7-2)13-16-14-20-18(21-16)10-8-15(9-11-18)17(3,4)5/h15-16H,6-14H2,1-5H3
56 atoms
O  -0.483766 1.008491 -0.726967
O  -0.307413 3.013348 0.299862
N  -2.854656 -0.283131 0.284445
C  2.694843 -0.045019 0.401262
C  0.378386 1.800406 0.071232
C  2.42268 0.700329 -0.910545
C  1.391761 -0.205992 1.191486
C  3.463454 -1.380433 0.207512
C  1.679211 2.015171 -0.688503
C  0.664421 1.117927 1.399846
C  -1.739059 1.645366 -0.85214
C  -1.367405 3.104061 -0.631029
C  2.628945 -2.427637 -0.535269
C  4.752837 -1.129816 -0.581101
C  3.861354 -1.950554 1.572454
C  -2.754732 1.156783 0.17621
C  -3.378479 -0.916176 -0.921254
C  -3.568489 -0.674944 1.49096
C  -2.324106 -1.511299 -1.853251
C  -3.291722 -2.105727 1.916727
C  -1.462596 -2.583369 -1.204482
H  3.353823 0.601569 0.999818
H  3.360288 0.924274 -1.421844
H  1.847158 0.069012 -1.593925
H  0.719853 -0.898228 0.676394
H  1.590782 -0.648267 2.169308
H  1.477066 2.503274 -1.64663
H  2.308204 2.698382 -0.10922
H  1.277828 1.786774 2.011899
H  -0.268527 0.953964 1.945888
H  -2.10666 1.475507 -1.867247
H  -2.171704 3.702412 -0.198554
H  -1.048284 3.582467 -1.564515
H  3.219856 -3.330181 -0.709796
H  1.746168 -2.730604 0.030597
H  2.291385 -2.073367 -1.511119
H  5.350727 -0.333713 -0.129366
H  4.562121 -0.852675 -1.618785
H  5.371833 -2.029854 -0.601277
H  4.479991 -2.842705 1.450369
H  4.440675 -1.228438 2.153883
H  2.998696 -2.242538 2.173049
H  -3.721584 1.627272 -0.078559
H  -2.474344 1.551675 1.157004
H  -4.056654 -1.723823 -0.632419
H  -4.001068 -0.207851 -1.488095
H  -3.245121 -0.015578 2.299785
H  -4.656589 -0.523556 1.395085
H  -1.683321 -0.729077 -2.263292
H  -2.853282 -1.939865 -2.709809
H  -3.621985 -2.83718 1.17789
H  -2.226673 -2.262236 2.093655
H  -3.821742 -2.326454 2.845028
H  -0.730573 -2.98042 -1.909761
H  -2.065687 -3.423365 -0.852904
H  -0.91366 -2.190568 -0.348642
elementType: O N C H
totalener: -912.31114425 hartree
nucrepener: 1979.40444836 hartree
electener: -2891.71559262 hartree
oneelecener: -5172.99455106 hartree
twoeener: 2281.27895844 hartree
cpcmener: -0.01703683 hartree
kineticenergy: 907.79611268 hartree
xcener: -92.071224727858 hartree
chargesum: 0.0000000
charge: -0.403752 -0.402386 -0.206013 0.098089 0.554027 -0.227975 -0.206631 0.266946 -0.260747 -0.275727 0.230865 -0.005532 -0.389572 -0.356836 -0.361253 -0.234130 -0.119648 -0.056742 -0.087792 -0.267300 -0.280465 0.057497 0.086105 0.078135 0.043755 0.088237 0.079311 0.077523 0.090906 0.083810 0.097878 0.100130 0.086211 0.101163 0.091774 0.099941 0.098659 0.094313 0.094483 0.094566 0.096802 0.095255 0.090169 0.100331 0.096379 0.087269 0.078459 0.069849 0.061303 0.071064 0.081054 0.076055 0.096650 0.101250 0.090170 0.056117
qa: -0.4038 -0.4024 -0.2060 0.0981 0.5540 -0.2280 -0.2066 0.2669 -0.2607 -0.2757 0.2309 -0.0055 -0.3896 -0.3568 -0.3613 -0.2341 -0.1196 -0.0567 -0.0878 -0.2673 -0.2805 0.0575 0.0861 0.0781 0.0438 0.0882 0.0793 0.0775 0.0909 0.0838 0.0979 0.1001 0.0862 0.1012 0.0918 0.0999 0.0987 0.0943 0.0945 0.0946 0.0968 0.0953 0.0902 0.1003 0.0964 0.0873 0.0785 0.0698 0.0613 0.0711 0.0811 0.0761 0.0967 0.1012 0.0902 0.0561
va: 1.9897 1.9981 2.7721 3.6999 3.8255 3.9282 3.9885 3.6700 4.0522 4.0274 3.7621 4.0333 3.9566 3.9249 3.9222 3.9690 3.8920 3.8854 3.8339 3.9211 3.9310 1.0157 1.0119 1.0183 1.0185 1.0160 1.0183 1.0201 1.0179 1.0148 0.9900 0.9936 0.9956 1.0071 0.9939 0.9988 1.0023 0.9973 1.0077 1.0063 1.0032 1.0000 1.0160 0.9994 0.9969 1.0112 0.9953 1.0029 1.0118 1.0147 1.0014 1.0056 1.0113 1.0056 1.0032 0.9998
dispcorr: -0.032305753 hartree
energy: -912.343450007297
dipole: 4.32260 -5.06563 -0.74302 -17.73492 17.93936 0.20444 1.07270 -1.30532 -0.23262
magnitude: 0.80498 au
magnitude: 2.04609 debye
