program: Orca
programVersion: 5.0.2
elementType: O O N C C C C C C C C C C C C C C C C C C H H H H H H H H H H H H H H H H H H H H H H H H H H H H H H H H H H H
charge: 0
multiplicity: 1
keywords: wb97x-d3
keywords: def2-TZVPP
keywords: def2/J RIJCOSX
keywords: DEFGRID2
keywords: scfconv7
keywords: smallprint printgap noloewdin
keywords: NOSOSCF
formula: C18H35NO2
InChI: InChI=1/C18H35NO2/c1-6-12-19(7-2)13-16-14-20-18(21-16)10-8-15(9-11-18)17(3,4)5/h15-16H,6-14H2,1-5H3
56 atoms
O  -0.62565 1.208497 -0.447401
O  -0.103646 3.251496 0.302502
N  -2.863484 -0.476084 0.294529
C  2.729099 0.059668 0.004873
C  0.443913 1.976172 0.064945
C  2.166607 0.710539 -1.262887
C  1.627024 -0.018313 1.067032
C  3.448913 -1.290858 -0.257036
C  1.535676 2.072414 -0.984552
C  0.999901 1.346228 1.339857
C  -1.857382 1.761543 -0.01891
C  -1.446914 3.058979 0.691849
C  2.519201 -2.33772 -0.874303
C  4.634256 -1.069372 -1.202055
C  4.006393 -1.846912 1.056426
C  -2.623279 0.816762 0.892607
C  -3.156244 -1.523718 1.253665
C  -3.776856 -0.449663 -0.841784
C  -2.815973 -2.91628 0.73481
C  -3.104999 -0.780199 -2.165734
C  -1.334394 -3.102794 0.445171
H  3.499623 0.739298 0.398714
H  2.952164 0.845221 -2.008541
H  1.420202 0.055365 -1.721364
H  0.847646 -0.720504 0.755158
H  2.026282 -0.402396 2.007077
H  1.123432 2.496814 -1.904129
H  2.302228 2.765903 -0.625764
H  1.758066 2.019954 1.751745
H  0.217848 1.253095 2.099393
H  -2.452923 1.987309 -0.910524
H  -1.543248 2.970155 1.781766
H  -2.034357 3.920953 0.373895
H  1.659497 -2.556312 -0.237347
H  2.137101 -2.030423 -1.849465
H  3.053365 -3.279304 -1.023712
H  5.314116 -0.304313 -0.817939
H  4.324615 -0.762621 -2.202111
H  5.211565 -1.989687 -1.317701
H  4.63038 -1.112001 1.572017
H  3.220834 -2.157088 1.74699
H  4.627402 -2.725714 0.866842
H  -3.551567 1.332166 1.199587
H  -2.038017 0.671122 1.804445
H  -2.560271 -1.340654 2.152196
H  -4.210664 -1.504067 1.576859
H  -4.598263 -1.154824 -0.673557
H  -4.257981 0.532613 -0.917629
H  -3.402955 -3.139234 -0.161461
H  -3.137974 -3.641984 1.487161
H  -2.674893 -1.78296 -2.15285
H  -3.826351 -0.740242 -2.984939
H  -2.301962 -0.078994 -2.396545
H  -0.736594 -2.95385 1.347479
H  -0.981104 -2.3951 -0.304945
H  -1.123484 -4.107975 0.07635
elementType: O N C H
totalener: -912.31151726 hartree
nucrepener: 1964.95601320 hartree
electener: -2877.26753045 hartree
oneelecener: -5143.90780442 hartree
twoeener: 2266.64027397 hartree
cpcmener: -0.01789590 hartree
kineticenergy: 907.79126118 hartree
xcener: -92.070029094715 hartree
chargesum: -0.0000000
charge: -0.408362 -0.386707 -0.210539 0.094442 0.563195 -0.220280 -0.206874 0.271590 -0.271076 -0.278661 0.208484 -0.009447 -0.377928 -0.357930 -0.361808 -0.187587 -0.088874 -0.054211 -0.096231 -0.272424 -0.273270 0.056775 0.088953 0.079117 0.035349 0.089015 0.076520 0.083526 0.087139 0.091563 0.088544 0.078099 0.100432 0.084080 0.098216 0.099806 0.097306 0.093839 0.094176 0.099422 0.093624 0.094506 0.087217 0.083697 0.080269 0.079510 0.077308 0.075930 0.063191 0.071161 0.080172 0.092563 0.082131 0.082444 0.056566 0.102329
qa: -0.4084 -0.3867 -0.2105 0.0944 0.5632 -0.2203 -0.2069 0.2716 -0.2711 -0.2787 0.2085 -0.0094 -0.3779 -0.3579 -0.3618 -0.1876 -0.0889 -0.0542 -0.0962 -0.2724 -0.2733 0.0568 0.0890 0.0791 0.0353 0.0890 0.0765 0.0835 0.0871 0.0916 0.0885 0.0781 0.1004 0.0841 0.0982 0.0998 0.0973 0.0938 0.0942 0.0994 0.0936 0.0945 0.0872 0.0837 0.0803 0.0795 0.0773 0.0759 0.0632 0.0712 0.0802 0.0926 0.0821 0.0824 0.0566 0.1023
va: 1.9797 2.0167 2.7940 3.6972 3.8215 3.9236 3.9887 3.6651 4.0454 3.9894 3.7710 4.0080 3.9643 3.9242 3.9244 4.0063 3.9221 3.8626 3.8598 3.9306 3.9170 1.0165 1.0132 1.0167 1.0285 1.0117 1.0314 1.0165 1.0231 1.0143 0.9926 0.9980 0.9940 0.9950 0.9991 1.0074 1.0032 1.0008 1.0067 1.0022 0.9982 1.0076 1.0069 0.9983 0.9990 1.0057 1.0052 1.0061 1.0052 1.0150 0.9970 1.0113 1.0051 0.9972 1.0150 1.0048
dispcorr: -0.031525006 hartree
energy: -912.343042265083
dipole: 4.43876 -5.20723 -0.76847 -18.34387 18.25924 -0.08462 -1.12864 1.79700 0.66837
magnitude: 1.02197 au
magnitude: 2.59764 debye
