program: Orca
programVersion: 5.0.2
elementType: O O N C C C C C C C C C C C C C C C C C C H H H H H H H H H H H H H H H H H H H H H H H H H H H H H H H H H H H
charge: 0
multiplicity: 1
keywords: wb97x-d3
keywords: def2-TZVPP
keywords: def2/J RIJCOSX
keywords: DEFGRID2
keywords: scfconv7
keywords: smallprint printgap noloewdin
keywords: NOSOSCF
formula: C18H35NO2
InChI: InChI=1/C18H35NO2/c1-6-12-19(7-2)13-16-14-20-18(21-16)10-8-15(9-11-18)17(3,4)5/h15-16H,6-14H2,1-5H3
56 atoms
O  -0.375053 1.013978 -0.885861
O  -0.393484 2.815419 0.472791
N  -3.076633 -0.154923 -0.181361
C  2.821465 0.016884 0.485201
C  0.361271 1.67427 0.132015
C  2.627361 0.941082 -0.720569
C  1.447366 -0.441932 0.981205
C  3.813061 -1.150458 0.234062
C  1.714418 2.12038 -0.397192
C  0.537185 0.734861 1.320324
C  -1.616683 1.668792 -1.089824
C  -1.740517 2.539813 0.150681
C  4.104987 -1.871534 1.553986
C  3.266995 -2.168252 -0.770434
C  5.143479 -0.604286 -0.294163
C  -2.73234 0.664091 -1.332515
C  -3.104803 -1.577044 -0.489512
C  -4.299531 0.290803 0.475255
C  -1.722414 -2.201306 -0.601185
C  -4.370935 -0.107167 1.938813
C  -1.793076 -3.679595 -0.950186
H  3.268839 0.627295 1.283993
H  3.584626 1.340215 -1.05916
H  2.214016 0.379115 -1.564027
H  0.967274 -1.061019 0.21821
H  1.543079 -1.071141 1.867852
H  1.572066 2.746896 -1.282398
H  2.190739 2.747728 0.363131
H  0.969168 1.303734 2.149511
H  -0.439387 0.371881 1.654701
H  -1.55031 2.305272 -1.983377
H  -2.244057 2.019438 0.9721
H  -2.262623 3.478582 -0.037858
H  4.850883 -2.656534 1.407999
H  4.499808 -1.183279 2.306072
H  3.220444 -2.349806 1.97707
H  4.011219 -2.943349 -0.969221
H  3.017295 -1.709964 -1.729511
H  2.371791 -2.672912 -0.402438
H  5.89723 -1.394667 -0.322756
H  5.062279 -0.207109 -1.30706
H  5.532933 0.192925 0.344753
H  -2.424516 0.029971 -2.168805
H  -3.602436 1.220749 -1.704837
H  -3.642237 -2.094184 0.308658
H  -3.676804 -1.776449 -1.411632
H  -4.344628 1.380331 0.417817
H  -5.195658 -0.071432 -0.054567
H  -1.199453 -2.068361 0.349686
H  -1.127031 -1.68044 -1.355657
H  -4.336089 -1.187878 2.08289
H  -3.546124 0.330497 2.503608
H  -5.304487 0.245118 2.380037
H  -0.799136 -4.128061 -0.980274
H  -2.252761 -3.83954 -1.92768
H  -2.38088 -4.236204 -0.216973
elementType: O N C H
totalener: -912.31385065 hartree
nucrepener: 1948.95680103 hartree
electener: -2861.27065168 hartree
oneelecener: -5111.93630444 hartree
twoeener: 2250.66565276 hartree
cpcmener: -0.01648534 hartree
kineticenergy: 907.78878838 hartree
xcener: -92.068913411438 hartree
chargesum: 0.0000000
charge: -0.418210 -0.395896 -0.239619 0.103765 0.602591 -0.215771 -0.252155 0.269010 -0.281910 -0.281138 0.187358 -0.018997 -0.359904 -0.382893 -0.359233 -0.112862 -0.094781 -0.066344 -0.082293 -0.262881 -0.282434 0.057145 0.085031 0.075898 0.067209 0.093821 0.079323 0.082927 0.086387 0.069992 0.067937 0.080169 0.106969 0.094719 0.095899 0.095575 0.098704 0.099776 0.093689 0.094920 0.093895 0.099824 0.092509 0.094514 0.090426 0.075467 0.087839 0.077740 0.048869 0.054421 0.083708 0.074389 0.092561 0.091046 0.081647 0.079656
qa: -0.4182 -0.3959 -0.2396 0.1038 0.6026 -0.2158 -0.2522 0.2690 -0.2819 -0.2811 0.1874 -0.0190 -0.3599 -0.3829 -0.3592 -0.1129 -0.0948 -0.0663 -0.0823 -0.2629 -0.2824 0.0571 0.0850 0.0759 0.0672 0.0938 0.0793 0.0829 0.0864 0.0700 0.0679 0.0802 0.1070 0.0947 0.0959 0.0956 0.0987 0.0998 0.0937 0.0949 0.0939 0.0998 0.0925 0.0945 0.0904 0.0755 0.0878 0.0777 0.0489 0.0544 0.0837 0.0744 0.0926 0.0910 0.0816 0.0797
va: 1.9851 2.0061 2.7976 3.6868 3.7354 3.9104 3.9799 3.6673 4.0652 4.0112 3.9007 3.9760 3.9227 3.9537 3.9236 3.8841 3.9122 3.8825 3.8571 3.9333 3.9699 1.0167 1.0139 1.0214 1.0067 1.0117 1.0238 1.0169 1.0262 1.0384 1.0072 1.0026 0.9941 1.0060 1.0035 1.0013 1.0057 1.0008 0.9973 1.0072 0.9975 1.0021 1.0034 1.0079 0.9970 1.0037 0.9875 1.0062 1.0098 1.0197 1.0020 1.0062 1.0088 1.0037 1.0014 0.9999
dispcorr: -0.030815884 hartree
energy: -912.344666536846
dipole: 3.85169 -4.73174 -0.88005 -16.85481 16.66877 -0.18604 1.91749 -2.11995 -0.20246
magnitude: 0.92200 au
magnitude: 2.34354 debye
