program: Orca
programVersion: 5.0.2
elementType: O O N C C C C C C C C C C C C C C C C C C H H H H H H H H H H H H H H H H H H H H H H H H H H H H H H H H H H H
charge: 0
multiplicity: 1
keywords: wb97x-d3
keywords: def2-TZVPP
keywords: def2/J RIJCOSX
keywords: DEFGRID2
keywords: scfconv7
keywords: smallprint printgap noloewdin
keywords: NOSOSCF
formula: C18H35NO2
InChI: InChI=1/C18H35NO2/c1-6-12-19(7-2)13-16-14-20-18(21-16)10-8-15(9-11-18)17(3,4)5/h15-16H,6-14H2,1-5H3
56 atoms
O  -0.413358 1.117852 -0.596603
O  -0.29194 2.645615 1.064827
N  -2.556948 -0.702353 0.004735
C  2.957905 0.095686 -0.044776
C  0.456157 1.661115 0.379255
C  2.503086 1.188504 -1.017676
C  1.734099 -0.488725 0.667186
C  3.877601 -0.97482 -0.691409
C  1.66467 2.261169 -0.325598
C  0.905358 0.588348 1.359914
C  -1.724417 1.603664 -0.389978
C  -1.456408 2.925417 0.313373
C  3.193726 -1.706969 -1.848527
C  5.153564 -0.30909 -1.216771
C  4.296435 -2.006964 0.360745
C  -2.583973 0.667144 0.457555
C  -2.887691 -1.669125 1.031639
C  -3.188869 -0.944747 -1.285704
C  -4.30681 -1.612272 1.598206
C  -2.193496 -1.341815 -2.365151
C  -4.543875 -2.697619 2.637639
H  3.567214 0.587576 0.728301
H  3.363434 1.673071 -1.48289
H  1.92245 0.748055 -1.833537
H  1.100896 -1.028973 -0.043542
H  2.038173 -1.217724 1.419797
H  1.336664 3.013237 -1.049524
H  2.276916 2.779609 0.418734
H  1.502555 1.061385 2.145974
H  0.035697 0.140759 1.8489
H  -2.184099 1.754031 -1.37088
H  -2.255245 3.228787 0.993325
H  -1.291409 3.738089 -0.403882
H  2.266919 -2.19448 -1.539753
H  2.95452 -1.038764 -2.677719
H  3.848884 -2.486119 -2.246105
H  5.661665 0.256109 -0.430888
H  4.960575 0.376021 -2.043535
H  5.856535 -1.060216 -1.584644
H  5.059304 -2.677224 -0.04216
H  4.719505 -1.528522 1.248063
H  3.465599 -2.633723 0.687703
H  -3.598013 1.101333 0.478698
H  -2.222743 0.689856 1.490362
H  -2.704187 -2.669973 0.626393
H  -2.174464 -1.548114 1.854949
H  -3.938274 -1.737438 -1.194784
H  -3.748287 -0.060581 -1.611201
H  -5.035311 -1.716516 0.788401
H  -4.4871 -0.631926 2.04881
H  -1.471996 -0.549281 -2.566774
H  -1.633928 -2.231858 -2.070727
H  -2.706974 -1.569503 -3.301838
H  -4.411669 -3.69454 2.211761
H  -5.554519 -2.648363 3.045126
H  -3.849435 -2.605753 3.475581
elementType: O N C H
totalener: -912.31152531 hartree
nucrepener: 1929.39209874 hartree
electener: -2841.70362405 hartree
oneelecener: -5072.85253010 hartree
twoeener: 2231.14890605 hartree
cpcmener: -0.01764231 hartree
kineticenergy: 907.79171106 hartree
xcener: -92.069844587487 hartree
chargesum: -0.0000000
charge: -0.412730 -0.405364 -0.225010 0.095212 0.571565 -0.228837 -0.226068 0.260495 -0.263613 -0.286849 0.236460 -0.003638 -0.375079 -0.358275 -0.360702 -0.232284 -0.083273 -0.048716 -0.083723 -0.272342 -0.278548 0.057308 0.087813 0.079348 0.064166 0.085455 0.078959 0.077620 0.090764 0.085235 0.099107 0.097122 0.085488 0.099024 0.094550 0.097257 0.097567 0.094262 0.094159 0.094537 0.098769 0.094214 0.092267 0.105259 0.085130 0.076139 0.077987 0.075996 0.060101 0.059784 0.078735 0.078446 0.088654 0.079692 0.091358 0.079048
qa: -0.4127 -0.4054 -0.2250 0.0952 0.5716 -0.2288 -0.2261 0.2605 -0.2636 -0.2868 0.2365 -0.0036 -0.3751 -0.3583 -0.3607 -0.2323 -0.0833 -0.0487 -0.0837 -0.2723 -0.2785 0.0573 0.0878 0.0793 0.0642 0.0855 0.0790 0.0776 0.0908 0.0852 0.0991 0.0971 0.0855 0.0990 0.0946 0.0973 0.0976 0.0943 0.0942 0.0945 0.0988 0.0942 0.0923 0.1053 0.0851 0.0761 0.0780 0.0760 0.0601 0.0598 0.0787 0.0784 0.0887 0.0797 0.0914 0.0790
va: 1.9910 1.9976 2.8010 3.6854 3.7981 3.9328 3.9452 3.6745 4.0613 4.0197 3.7789 4.0339 3.9460 3.9234 3.9252 3.9701 3.9620 3.8682 3.8354 3.9477 3.9496 1.0167 1.0117 1.0168 1.0275 1.0144 1.0194 1.0202 1.0191 1.0156 0.9936 0.9937 0.9950 0.9998 1.0000 1.0047 1.0029 1.0008 1.0067 1.0073 1.0025 0.9977 1.0043 0.9923 0.9958 0.9980 0.9993 1.0012 1.0105 1.0092 1.0053 1.0035 1.0118 1.0018 1.0024 1.0015
dispcorr: -0.029825005 hartree
energy: -912.341350313261
dipole: 2.26822 -3.10411 -0.83589 -15.39419 15.50061 0.10643 -1.96364 1.92080 -0.04284
magnitude: 0.84373 au
magnitude: 2.14458 debye
