program: Orca
programVersion: 5.0.2
elementType: O O N C C C C C C C C C C C C C C C C C C H H H H H H H H H H H H H H H H H H H H H H H H H H H H H H H H H H H
charge: 0
multiplicity: 1
keywords: wb97x-d3
keywords: def2-TZVPP
keywords: def2/J RIJCOSX
keywords: DEFGRID2
keywords: scfconv7
keywords: smallprint printgap noloewdin
keywords: NOSOSCF
formula: C18H35NO2
InChI: InChI=1/C18H35NO2/c1-6-12-19(7-2)13-16-14-20-18(21-16)10-8-15(9-11-18)17(3,4)5/h15-16H,6-14H2,1-5H3
56 atoms
O  -0.107265 0.206615 -0.011486
O  -0.249907 2.423915 -0.440802
N  -3.764588 -0.224816 0.00363
C  3.47176 0.439736 0.202645
C  0.666672 1.381981 -0.169789
C  2.682407 0.173192 -1.082843
C  2.492427 0.564807 1.374487
C  4.623482 -0.571513 0.445068
C  1.62529 1.24153 -1.343617
C  1.437056 1.637598 1.117083
C  -1.447865 0.4687 -0.388698
C  -1.552119 1.963884 -0.142467
C  5.345576 -0.24051 1.754827
C  4.122467 -2.015524 0.51347
C  5.650716 -0.458211 -0.685721
C  -2.387775 -0.387693 0.441475
C  -4.354991 -1.427431 -0.554386
C  -4.617813 0.456964 0.960757
C  -3.747001 -1.82709 -1.891516
C  -4.963692 -0.314752 2.230229
C  -4.378313 -3.094159 -2.447335
H  3.953998 1.422184 0.08749
H  3.349132 0.133388 -1.946117
H  2.196709 -0.805456 -1.027052
H  2.003006 -0.395515 1.564539
H  3.02104 0.824218 2.292916
H  1.06293 1.006539 -2.252294
H  2.112504 2.206936 -1.513966
H  1.926816 2.612917 1.035236
H  0.741081 1.698808 1.959096
H  -1.59873 0.247777 -1.454573
H  -1.824744 2.178659 0.899731
H  -2.266207 2.465885 -0.795752
H  4.727595 -0.427228 2.634277
H  6.243172 -0.854068 1.86147
H  5.660831 0.805865 1.786626
H  3.368875 -2.155356 1.291365
H  4.947762 -2.694841 0.740412
H  3.68689 -2.347438 -0.430605
H  6.507783 -1.10875 -0.495999
H  5.241943 -0.74676 -1.655117
H  6.030375 0.562608 -0.778172
H  -2.269244 -0.117432 1.497143
H  -2.076571 -1.435041 0.366307
H  -4.288315 -2.284847 0.135761
H  -5.422604 -1.238882 -0.704154
H  -4.137608 1.400519 1.233935
H  -5.544245 0.733246 0.448853
H  -2.669577 -1.983122 -1.78397
H  -3.87189 -1.004788 -2.601287
H  -5.527799 -1.223887 2.016041
H  -4.071787 -0.599718 2.791937
H  -5.5788 0.301542 2.888511
H  -5.450886 -2.969768 -2.610554
H  -4.245679 -3.938017 -1.76721
H  -3.932582 -3.372862 -3.402972
elementType: O N C H
totalener: -912.31455587 hartree
nucrepener: 1866.08245777 hartree
electener: -2778.39701364 hartree
oneelecener: -4945.64504358 hartree
twoeener: 2167.24802994 hartree
cpcmener: -0.01508841 hartree
kineticenergy: 907.79802626 hartree
xcener: -92.069246812273 hartree
chargesum: 0.0000000
charge: -0.419461 -0.401495 -0.240035 0.085617 0.598227 -0.229700 -0.226686 0.258704 -0.275639 -0.274802 0.144424 0.016636 -0.361514 -0.370838 -0.356684 -0.111635 -0.090051 -0.045405 -0.065731 -0.277520 -0.285184 0.056038 0.087490 0.078722 0.079073 0.086938 0.080731 0.084075 0.079293 0.082761 0.071428 0.075564 0.093630 0.093936 0.094900 0.099160 0.097608 0.096852 0.094304 0.094410 0.094224 0.096725 0.093959 0.094745 0.066886 0.082435 0.077789 0.076115 0.057855 0.051822 0.084740 0.080601 0.093784 0.080396 0.078251 0.091531
qa: -0.4195 -0.4015 -0.2400 0.0856 0.5982 -0.2297 -0.2267 0.2587 -0.2756 -0.2748 0.1444 0.0166 -0.3615 -0.3708 -0.3567 -0.1116 -0.0901 -0.0454 -0.0657 -0.2775 -0.2852 0.0560 0.0875 0.0787 0.0791 0.0869 0.0807 0.0841 0.0793 0.0828 0.0714 0.0756 0.0936 0.0939 0.0949 0.0992 0.0976 0.0969 0.0943 0.0944 0.0942 0.0967 0.0940 0.0947 0.0669 0.0824 0.0778 0.0761 0.0579 0.0518 0.0847 0.0806 0.0938 0.0804 0.0783 0.0915
va: 1.9896 2.0051 2.8543 3.6889 3.7555 3.9266 3.9207 3.6727 4.0601 4.0522 3.9541 3.9515 3.9267 3.9451 3.9233 3.8596 3.9489 3.9444 3.8261 3.8989 3.9631 1.0168 1.0150 1.0188 1.0206 1.0123 1.0190 1.0182 1.0207 1.0175 1.0079 0.9998 1.0012 0.9979 1.0073 1.0023 1.0013 1.0047 0.9993 1.0062 1.0019 1.0036 1.0064 1.0073 0.9926 0.9966 0.9954 0.9996 1.0105 1.0202 0.9997 1.0034 1.0100 1.0007 1.0021 1.0037
dispcorr: -0.027922670 hartree
energy: -912.342478537088
dipole: 1.89420 -2.43727 -0.54307 -12.43235 12.07963 -0.35272 2.25588 -1.90798 0.34790
magnitude: 0.73510 au
magnitude: 1.86847 debye
