program: Orca
programVersion: 5.0.2
elementType: O O N C C C C C C C C C C C C C C C C C C H H H H H H H H H H H H H H H H H H H H H H H H H H H H H H H H H H H
charge: 0
multiplicity: 1
keywords: wb97x-d3
keywords: def2-TZVPP
keywords: def2/J RIJCOSX
keywords: DEFGRID2
keywords: scfconv7
keywords: smallprint printgap noloewdin
keywords: NOSOSCF
formula: C18H35NO2
InChI: InChI=1/C18H35NO2/c1-6-12-19(7-2)13-16-14-20-18(21-16)10-8-15(9-11-18)17(3,4)5/h15-16H,6-14H2,1-5H3
56 atoms
O  -0.061039 0.443463 -0.736229
O  -0.409505 1.475063 1.245092
N  -3.686206 -0.147782 -0.273102
C  3.446748 0.110643 0.039444
C  0.594488 0.896215 0.443131
C  2.803669 1.27007 -0.727558
C  2.361988 -0.90879 0.400003
C  4.681727 -0.504591 -0.671518
C  1.666876 1.91124 0.063246
C  1.218707 -0.27355 1.186488
C  -1.438966 0.780841 -0.673641
C  -1.460011 1.868183 0.384896
C  4.344371 -1.053195 -2.059069
C  5.773362 0.560266 -0.817933
C  5.259748 -1.641426 0.177227
C  -2.267688 -0.446034 -0.298451
C  -4.411948 -0.846011 0.775169
C  -4.323515 -0.231502 -1.577047
C  -4.183874 -0.24836 2.158157
C  -4.503629 -1.629451 -2.162169
C  -4.907308 -1.029988 3.243985
H  3.822855 0.523099 0.9879
H  3.541266 2.041659 -0.955254
H  2.42178 0.918198 -1.690646
H  1.965501 -1.37475 -0.507408
H  2.776058 -1.718777 1.002457
H  1.222471 2.730768 -0.509427
H  2.066928 2.347409 0.984075
H  1.5980 0.090404 2.146555
H  0.449846 -1.01878 1.409769
H  -1.747756 1.165017 -1.650271
H  -2.391777 1.907491 0.948676
H  -1.280288 2.859034 -0.049971
H  5.225036 -1.51813 -2.508863
H  3.563138 -1.815143 -2.02412
H  4.011897 -0.270883 -2.743776
H  6.035159 0.998907 0.148543
H  5.47921 1.375006 -1.480963
H  6.6838 0.123629 -1.235249
H  6.213102 -1.980868 -0.234574
H  5.445211 -1.320693 1.205855
H  4.603582 -2.512117 0.215091
H  -1.953933 -0.783986 0.69209
H  -2.017265 -1.2674 -0.985645
H  -5.479889 -0.778454 0.547175
H  -4.176578 -1.92233 0.80229
H  -5.303289 0.249836 -1.504906
H  -3.747602 0.376115 -2.280194
H  -4.525525 0.790252 2.155349
H  -3.115104 -0.219706 2.389553
H  -5.152539 -2.25152 -1.543587
H  -4.964478 -1.562114 -3.149248
H  -3.554834 -2.154443 -2.284654
H  -4.745975 -0.585588 4.226963
H  -4.558065 -2.063474 3.29212
H  -5.985072 -1.055653 3.070085
elementType: O N C H
totalener: -912.31496341 hartree
nucrepener: 1879.04738812 hartree
electener: -2791.36235152 hartree
oneelecener: -4971.69564635 hartree
twoeener: 2180.33329483 hartree
cpcmener: -0.01479953 hartree
kineticenergy: 907.78935779 hartree
xcener: -92.069812161311 hartree
chargesum: 0.0000000
charge: -0.436392 -0.404583 -0.235440 0.088821 0.562624 -0.227010 -0.222682 0.257456 -0.270636 -0.278326 0.281115 -0.021520 -0.371433 -0.356647 -0.359718 -0.230979 -0.085131 -0.045077 -0.071552 -0.278168 -0.283801 0.055403 0.088330 0.077595 0.077646 0.086074 0.081749 0.078293 0.087599 0.085213 0.092482 0.100346 0.090834 0.097264 0.097522 0.094164 0.097420 0.093958 0.094511 0.094291 0.099450 0.093585 0.108217 0.094100 0.083577 0.071861 0.075122 0.075316 0.052802 0.054448 0.083389 0.093772 0.082252 0.091622 0.078660 0.080212
qa: -0.4364 -0.4046 -0.2354 0.0888 0.5626 -0.2270 -0.2227 0.2575 -0.2706 -0.2783 0.2811 -0.0215 -0.3714 -0.3566 -0.3597 -0.2310 -0.0851 -0.0451 -0.0716 -0.2782 -0.2838 0.0554 0.0883 0.0776 0.0776 0.0861 0.0817 0.0783 0.0876 0.0852 0.0925 0.1003 0.0908 0.0973 0.0975 0.0942 0.0974 0.0940 0.0945 0.0943 0.0995 0.0936 0.1082 0.0941 0.0836 0.0719 0.0751 0.0753 0.0528 0.0544 0.0834 0.0938 0.0823 0.0916 0.0787 0.0802
va: 1.9938 1.9850 2.8377 3.6843 3.8049 3.9263 3.9284 3.6752 4.0774 4.0337 3.7943 3.9552 3.9452 3.9231 3.9251 3.9779 3.9204 3.9578 3.8410 3.8913 3.9646 1.0169 1.0131 1.0213 1.0203 1.0139 1.0155 1.0213 1.0181 1.0176 1.0030 1.0123 0.9971 1.0043 1.0013 0.9998 1.0034 1.0015 1.0063 1.0072 1.0023 0.9983 0.9953 1.0181 0.9949 0.9918 0.9980 0.9968 1.0179 1.0154 0.9992 1.0098 1.0029 1.0038 1.0020 1.0004
dispcorr: -0.028523098 hartree
energy: -912.343486503466
dipole: 2.33704 -2.74602 -0.40898 -9.25854 9.12272 -0.13581 -1.23863 0.94729 -0.29134
magnitude: 0.52018 au
magnitude: 1.32220 debye
