program: Orca
programVersion: 5.0.2
elementType: O O N C C C C C C C C C C C C C C C C C C H H H H H H H H H H H H H H H H H H H H H H H H H H H H H H H H H H H
charge: 0
multiplicity: 1
keywords: wb97x-d3
keywords: def2-TZVPP
keywords: def2/J RIJCOSX
keywords: DEFGRID2
keywords: scfconv7
keywords: smallprint printgap noloewdin
keywords: NOSOSCF
formula: C18H35NO2
InChI: InChI=1/C18H35NO2/c1-6-12-19(7-2)13-16-14-20-18(21-16)10-8-15(9-11-18)17(3,4)5/h15-16H,6-14H2,1-5H3
56 atoms
O  -0.08232 0.255691 0.167089
O  -0.324305 2.419759 -0.443483
N  -3.602305 -0.797166 0.401381
C  3.483488 0.548075 0.031141
C  0.641518 1.424522 -0.166874
C  2.593514 0.166471 -1.156285
C  2.606688 0.767866 1.268408
C  4.662816 -0.431629 0.270391
C  1.495077 1.195875 -1.405593
C  1.518624 1.807687 1.01561
C  -1.453768 0.438303 -0.145448
C  -1.588121 1.94736 -0.024981
C  5.588441 0.129263 1.354768
C  4.187375 -1.820323 0.702919
C  5.489562 -0.573481 -1.011674
C  -2.280893 -0.402435 0.83433
C  -3.5971 -1.76532 -0.685779
C  -4.532768 0.292091 0.163103
C  -4.732256 -2.775921 -0.580752
C  -4.836246 1.124177 1.396286
C  -4.71758 -3.768533 -1.732787
H  3.942046 1.517876 -0.214038
H  3.184486 0.075131 -2.068954
H  2.138801 -0.814457 -0.987691
H  2.141606 -0.174629 1.572404
H  3.208815 1.098837 2.11634
H  0.860199 0.881256 -2.239425
H  1.948214 2.149363 -1.695527
H  1.981858 2.776187 0.803483
H  0.899273 1.938343 1.907967
H  -1.653047 0.120342 -1.179287
H  -1.802441 2.244161 1.010293
H  -2.357696 2.372443 -0.670826
H  5.931884 1.136647 1.105039
H  5.108661 0.17743 2.333315
H  6.475102 -0.499089 1.466589
H  3.506968 -2.269923 -0.023056
H  3.675402 -1.801036 1.66677
H  5.037704 -2.498713 0.806882
H  6.405646 -1.13593 -0.816677
H  4.953729 -1.104302 -1.799903
H  5.784103 0.401235 -1.409594
H  -2.347494 0.126364 1.790038
H  -1.72037 -1.317765 1.040762
H  -3.63273 -1.278912 -1.673901
H  -2.651153 -2.313077 -0.658132
H  -4.200745 0.955043 -0.65341
H  -5.471054 -0.145404 -0.184688
H  -5.697708 -2.263113 -0.557163
H  -4.642119 -3.307777 0.369962
H  -3.973791 1.687966 1.753898
H  -5.618177 1.849485 1.166839
H  -5.192181 0.497501 2.21551
H  -3.777906 -4.323745 -1.770357
H  -4.840346 -3.267252 -2.695067
H  -5.523216 -4.498159 -1.640481
elementType: O N C H
totalener: -912.31362686 hartree
nucrepener: 1865.19296228 hartree
electener: -2777.50658913 hartree
oneelecener: -4943.59767315 hartree
twoeener: 2166.09108401 hartree
cpcmener: -0.01610500 hartree
kineticenergy: 907.79383849 hartree
xcener: -92.069182390047 hartree
chargesum: -0.0000000
charge: -0.407374 -0.405707 -0.217175 0.089639 0.594738 -0.228982 -0.233866 0.257984 -0.274132 -0.273239 0.107678 0.019469 -0.357760 -0.373145 -0.359631 -0.132453 -0.080876 -0.088912 -0.065203 -0.261244 -0.280428 0.057134 0.085402 0.077974 0.081305 0.089341 0.080730 0.084187 0.079665 0.081969 0.088515 0.078953 0.099319 0.097181 0.094303 0.094830 0.098061 0.094103 0.097523 0.094255 0.093627 0.099136 0.100229 0.088748 0.070749 0.089760 0.072968 0.098552 0.053675 0.046275 0.080162 0.091900 0.081888 0.079366 0.078341 0.090496
qa: -0.4074 -0.4057 -0.2172 0.0896 0.5947 -0.2290 -0.2339 0.2580 -0.2741 -0.2732 0.1077 0.0195 -0.3578 -0.3731 -0.3596 -0.1325 -0.0809 -0.0889 -0.0652 -0.2612 -0.2804 0.0571 0.0854 0.0780 0.0813 0.0893 0.0807 0.0842 0.0797 0.0820 0.0885 0.0790 0.0993 0.0972 0.0943 0.0948 0.0981 0.0941 0.0975 0.0943 0.0936 0.0991 0.1002 0.0887 0.0707 0.0898 0.0730 0.0986 0.0537 0.0463 0.0802 0.0919 0.0819 0.0794 0.0783 0.0905
va: 1.9877 2.0049 2.8931 3.6863 3.7599 3.9276 3.9254 3.6737 4.0478 4.0529 3.7799 3.9441 3.9231 3.9458 3.9247 3.9628 3.9052 3.9122 3.8629 3.9075 3.9513 1.0169 1.0142 1.0198 1.0187 1.0124 1.0181 1.0181 1.0209 1.0188 1.0013 0.9995 0.9977 1.0033 1.0009 1.0064 1.0011 1.0000 1.0043 1.0074 0.9980 1.0024 0.9930 1.0122 0.9983 0.9969 1.0019 0.9903 1.0145 1.0210 1.0034 1.0073 1.0135 1.0010 1.0014 1.0046
dispcorr: -0.028028979 hartree
energy: -912.341655837225
dipole: 1.98009 -2.32415 -0.34406 -10.31106 10.31705 0.00598 -0.14739 -0.11262 -0.26001
magnitude: 0.43130 au
magnitude: 1.09626 debye
