program: Orca
programVersion: 5.0.2
elementType: O O N C C C C C C C C C C C C C C C C C C H H H H H H H H H H H H H H H H H H H H H H H H H H H H H H H H H H H
charge: 0
multiplicity: 1
keywords: wb97x-d3
keywords: def2-TZVPP
keywords: def2/J RIJCOSX
keywords: DEFGRID2
keywords: scfconv7
keywords: smallprint printgap noloewdin
keywords: NOSOSCF
formula: C18H35NO2
InChI: InChI=1/C18H35NO2/c1-6-12-19(7-2)13-16-14-20-18(21-16)10-8-15(9-11-18)17(3,4)5/h15-16H,6-14H2,1-5H3
56 atoms
O  -0.48187 0.862942 -0.311169
O  -0.103761 3.071295 -0.087424
N  -3.270684 -0.485469 0.019066
C  2.997153 0.140765 0.137703
C  0.540614 1.81978 -0.077066
C  2.31387 0.427644 -1.203317
C  1.960066 0.21764 1.262266
C  3.83151 -1.168621 0.153164
C  1.561111 1.756819 -1.198527
C  1.212419 1.546865 1.264456
C  -1.758687 1.476072 -0.212327
C  -1.42758 2.852982 0.350544
C  2.952978 -2.416825 0.043748
C  4.829491 -1.166971 -1.008714
C  4.637907 -1.246859 1.453249
C  -2.729115 0.694885 0.659118
C  -2.412274 -1.659183 0.041109
C  -4.647677 -0.769005 0.383497
C  -2.524958 -2.503304 -1.223932
C  -4.910523 -1.090038 1.852402
C  -2.133664 -1.749925 -2.485807
H  3.71528 0.957214 0.30681
H  3.049068 0.462539 -2.008542
H  1.622593 -0.382064 -1.456674
H  1.239691 -0.600484 1.169303
H  2.437576 0.091645 2.235602
H  1.060388 1.914226 -2.158003
H  2.273529 2.577757 -1.070872
H  1.915476 2.361257 1.466149
H  0.47166 1.560045 2.069617
H  -2.192205 1.568986 -1.216023
H  -1.503285 2.872311 1.446298
H  -2.070627 3.638851 -0.046882
H  2.291158 -2.533566 0.903888
H  2.330111 -2.407977 -0.852975
H  3.572884 -3.315295 -0.005194
H  4.342093 -1.259965 -1.980329
H  5.522443 -2.007177 -0.920534
H  5.427921 -0.252135 -1.024233
H  4.003913 -1.335965 2.336523
H  5.297651 -2.1177 1.446606
H  5.266645 -0.362505 1.585807
H  -3.562441 1.374432 0.864786
H  -2.254823 0.493026 1.632702
H  -1.375848 -1.3386 0.143474
H  -2.609254 -2.2953 0.916835
H  -5.261129 0.089198 0.093661
H  -4.999028 -1.601855 -0.231255
H  -3.54016 -2.89796 -1.328542
H  -1.878807 -3.377207 -1.100765
H  -4.641417 -0.259072 2.507147
H  -5.972078 -1.293176 2.005828
H  -4.362177 -1.97131 2.189357
H  -1.116562 -1.357213 -2.414878
H  -2.798598 -0.906765 -2.672782
H  -2.173149 -2.398869 -3.362377
elementType: O N C H
totalener: -912.31278995 hartree
nucrepener: 1930.49907621 hartree
electener: -2842.81186616 hartree
oneelecener: -5074.75042405 hartree
twoeener: 2231.93855788 hartree
cpcmener: -0.01508170 hartree
kineticenergy: 907.79202130 hartree
xcener: -92.071207882421 hartree
chargesum: 0.0000000
charge: -0.402023 -0.388436 -0.229579 0.091193 0.569693 -0.217145 -0.242909 0.259685 -0.271718 -0.275266 0.199153 -0.016948 -0.374571 -0.358847 -0.357655 -0.160925 -0.073516 -0.057223 -0.099003 -0.275929 -0.266361 0.056924 0.085367 0.077740 0.078254 0.090307 0.078198 0.084395 0.082777 0.085414 0.066579 0.079103 0.107837 0.094043 0.097815 0.097980 0.094408 0.094250 0.098882 0.094454 0.094717 0.096935 0.095535 0.082812 0.075907 0.086148 0.074023 0.080474 0.058478 0.065153 0.081539 0.093635 0.081647 0.068011 0.071608 0.096983
qa: -0.4020 -0.3884 -0.2296 0.0912 0.5697 -0.2171 -0.2429 0.2597 -0.2717 -0.2753 0.1992 -0.0169 -0.3746 -0.3588 -0.3577 -0.1609 -0.0735 -0.0572 -0.0990 -0.2759 -0.2664 0.0569 0.0854 0.0777 0.0783 0.0903 0.0782 0.0844 0.0828 0.0854 0.0666 0.0791 0.1078 0.0940 0.0978 0.0980 0.0944 0.0942 0.0989 0.0945 0.0947 0.0969 0.0955 0.0828 0.0759 0.0861 0.0740 0.0805 0.0585 0.0652 0.0815 0.0936 0.0816 0.0680 0.0716 0.0970
va: 1.9741 2.0151 2.8451 3.6855 3.7729 3.9368 3.9580 3.6759 4.0548 4.0257 3.8198 4.0095 3.9474 3.9235 3.9220 3.9829 3.8971 3.9576 3.8561 3.8965 3.9207 1.0171 1.0140 1.0083 1.0091 1.0142 1.0269 1.0168 1.0218 1.0142 1.0167 1.0004 0.9946 0.9993 1.0010 1.0053 0.9974 1.0078 1.0023 1.0010 1.0062 1.0034 0.9980 0.9986 1.0137 1.0083 0.9987 0.9941 1.0081 1.0151 1.0002 1.0093 1.0029 1.0052 1.0211 1.0063
dispcorr: -0.030052938 hartree
energy: -912.342842892743
dipole: 3.29101 -3.73604 -0.44503 -15.86824 15.76991 -0.09832 1.63011 -0.85261 0.77750
magnitude: 0.90124 au
magnitude: 2.29076 debye
