program: Orca
programVersion: 5.0.2
elementType: O O N C C C C C C C C C C C C C C C C C C H H H H H H H H H H H H H H H H H H H H H H H H H H H H H H H H H H H
charge: 0
multiplicity: 1
keywords: wb97x-d3
keywords: def2-TZVPP
keywords: def2/J RIJCOSX
keywords: DEFGRID2
keywords: scfconv7
keywords: smallprint printgap noloewdin
keywords: NOSOSCF
formula: C18H35NO2
InChI: InChI=1/C18H35NO2/c1-6-12-19(7-2)13-16-14-20-18(21-16)10-8-15(9-11-18)17(3,4)5/h15-16H,6-14H2,1-5H3
56 atoms
O  -0.403963 0.818877 -0.603224
O  -0.496291 2.52916 0.876699
N  -3.159649 -0.238478 -0.458749
C  2.94763 0.044012 0.407407
C  0.341044 1.497744 0.388796
C  2.576294 1.043887 -0.692798
C  1.667794 -0.56359 0.991451
C  3.998826 -1.008273 -0.037764
C  1.601233 2.111658 -0.204684
C  0.703988 0.51119 1.487155
C  -1.535243 1.595963 -0.949528
C  -1.791059 2.366872 0.332026
C  4.340491 -1.932346 1.134949
C  3.508763 -1.863716 -1.207619
C  5.291883 -0.30036 -0.455267
C  -2.68777 0.72986 -1.430051
C  -2.509505 -1.536803 -0.579574
C  -4.610773 -0.354506 -0.440392
C  -2.390041 -2.267121 0.750677
C  -5.298823 0.815995 0.238827
C  -1.661275 -3.59492 0.613067
H  3.422181 0.619539 1.216253
H  3.467163 1.545513 -1.074751
H  2.134863 0.516962 -1.543827
H  1.167483 -1.186085 0.242788
H  1.899848 -1.223539 1.828856
H  1.333809 2.784265 -1.02543
H  2.08256 2.726594 0.562457
H  1.169791 1.06658 2.306996
H  -0.205984 0.054222 1.887501
H  -1.2835 2.292395 -1.762896
H  -2.443207 1.806707 1.010376
H  -2.233952 3.3483 0.153361
H  5.167961 -2.595137 0.870781
H  4.646654 -1.364849 2.017855
H  3.504352 -2.570158 1.424925
H  3.315554 -1.269281 -2.102463
H  2.592809 -2.408109 -0.968694
H  4.262684 -2.607732 -1.476128
H  5.66222 0.355686 0.336854
H  6.077256 -1.029222 -0.669001
H  5.167884 0.304555 -1.354496
H  -2.410473 0.255305 -2.38238
H  -3.49256 1.42534 -1.681612
H  -3.031488 -2.178378 -1.309336
H  -1.505745 -1.392693 -0.980012
H  -5.017409 -0.488097 -1.45619
H  -4.872538 -1.263012 0.105485
H  -3.379925 -2.438553 1.183295
H  -1.854683 -1.623921 1.454447
H  -5.001093 0.890742 1.285745
H  -5.07732 1.770807 -0.241728
H  -6.381971 0.685734 0.207779
H  -2.17431 -4.267532 -0.077323
H  -1.585437 -4.107984 1.572638
H  -0.645009 -3.454013 0.237974
elementType: O N C H
totalener: -912.31420096 hartree
nucrepener: 1938.97195797 hartree
electener: -2851.28615893 hartree
oneelecener: -5091.79352990 hartree
twoeener: 2240.50737098 hartree
cpcmener: -0.01505204 hartree
kineticenergy: 907.79289445 hartree
xcener: -92.068871704435 hartree
chargesum: -0.0000000
charge: -0.416379 -0.404936 -0.227328 0.102657 0.605854 -0.232730 -0.239234 0.263004 -0.280139 -0.296830 0.186767 -0.006008 -0.361072 -0.376083 -0.358595 -0.130991 -0.118346 -0.054074 -0.078794 -0.276282 -0.279783 0.058232 0.087197 0.078178 0.072353 0.089937 0.080946 0.084430 0.090087 0.097168 0.067647 0.064483 0.097204 0.094718 0.098731 0.094647 0.096019 0.096299 0.097421 0.097954 0.094617 0.093631 0.096193 0.102683 0.078955 0.089488 0.071332 0.083557 0.068960 0.047297 0.077960 0.083676 0.096417 0.082993 0.092002 0.075911
qa: -0.4164 -0.4049 -0.2273 0.1027 0.6059 -0.2327 -0.2392 0.2630 -0.2801 -0.2968 0.1868 -0.0060 -0.3611 -0.3761 -0.3586 -0.1310 -0.1183 -0.0541 -0.0788 -0.2763 -0.2798 0.0582 0.0872 0.0782 0.0724 0.0899 0.0809 0.0844 0.0901 0.0972 0.0676 0.0645 0.0972 0.0947 0.0987 0.0946 0.0960 0.0963 0.0974 0.0980 0.0946 0.0936 0.0962 0.1027 0.0790 0.0895 0.0713 0.0836 0.0690 0.0473 0.0780 0.0837 0.0964 0.0830 0.0920 0.0759
va: 1.9907 1.9952 2.8141 3.6837 3.7286 3.9294 3.9596 3.6699 4.0702 4.0263 3.9184 3.9713 3.9241 3.9484 3.9224 3.9114 3.9154 3.8866 3.8496 3.9196 3.9522 1.0164 1.0146 1.0188 1.0043 1.0120 1.0168 1.0184 1.0233 1.0120 1.0058 1.0261 0.9951 1.0070 1.0027 0.9984 0.9996 1.0007 1.0050 1.0032 1.0067 1.0006 1.0083 0.9996 1.0059 1.0050 1.0047 0.9934 1.0126 1.0199 1.0074 1.0009 1.0107 1.0022 1.0036 1.0001
dispcorr: -0.030528808 hartree
energy: -912.344729769164
dipole: 4.19024 -4.75278 -0.56254 -14.32988 14.18865 -0.14123 -0.39730 -0.18152 -0.57882
magnitude: 0.81941 au
magnitude: 2.08278 debye
