program: Orca
programVersion: 5.0.2
elementType: O O N C C C C C C C C C C C C C C C C C C H H H H H H H H H H H H H H H H H H H H H H H H H H H H H H H H H H H
charge: 0
multiplicity: 1
keywords: wb97x-d3
keywords: def2-TZVPP
keywords: def2/J RIJCOSX
keywords: DEFGRID2
keywords: scfconv7
keywords: smallprint printgap noloewdin
keywords: NOSOSCF
formula: C18H35NO2
InChI: InChI=1/C18H35NO2/c1-6-12-19(7-2)13-16-14-20-18(21-16)10-8-15(9-11-18)17(3,4)5/h15-16H,6-14H2,1-5H3
56 atoms
O  -0.08186 0.182432 -0.578055
O  -0.264846 2.419642 -0.428208
N  -3.64628 -0.241741 0.320886
C  3.434392 0.402588 0.223152
C  0.654505 1.362559 -0.295312
C  2.840815 0.461047 -1.18801
C  2.297969 0.198934 1.230248
C  4.598387 -0.612455 0.377625
C  1.766534 1.537998 -1.314603
C  1.235271 1.287991 1.114297
C  -1.473754 0.464843 -0.559348
C  -1.532481 1.910063 -0.072852
C  4.129666 -2.060454 0.220188
C  5.680719 -0.330966 -0.670048
C  5.243779 -0.451865 1.75823
C  -2.216584 -0.512774 0.338865
C  -4.430825 -1.235575 -0.388374
C  -4.203146 0.1118 1.615729
C  -4.171407 -1.264094 -1.887905
C  -4.282792 -1.00851 2.648606
C  -5.053602 -2.284825 -2.590738
H  3.869495 1.39299 0.425299
H  3.616102 0.671758 -1.926014
H  2.416555 -0.510792 -1.458748
H  1.830587 -0.77839 1.076537
H  2.679066 0.197778 2.252539
H  1.341771 1.537745 -2.32233
H  2.220703 2.521832 -1.159937
H  1.680121 2.258732 1.355191
H  0.438425 1.114508 1.844063
H  -1.865301 0.393443 -1.581044
H  -1.699799 1.966753 1.010664
H  -2.303362 2.501092 -0.566186
H  4.978137 -2.745585 0.29071
H  3.41915 -2.351882 0.995811
H  3.654634 -2.238494 -0.74669
H  5.993578 0.716284 -0.65396
H  5.35328 -0.562786 -1.684462
H  6.567766 -0.938598 -0.477084
H  6.113237 -1.106401 1.85417
H  5.587724 0.572799 1.921668
H  4.564496 -0.706028 2.573135
H  -1.817515 -0.420921 1.354843
H  -2.001625 -1.540819 0.024051
H  -4.277266 -2.250721 0.012846
H  -5.487482 -1.000878 -0.227975
H  -3.614443 0.936418 2.02532
H  -5.206668 0.515273 1.451755
H  -3.12263 -1.501912 -2.086322
H  -4.349192 -0.267901 -2.301905
H  -4.688732 -0.626742 3.587067
H  -4.931983 -1.821822 2.320587
H  -3.30045 -1.43292 2.866979
H  -4.872955 -3.293929 -2.214917
H  -4.866715 -2.298693 -3.665075
H  -6.113329 -2.065427 -2.445604
elementType: O N C H
totalener: -912.31398740 hartree
nucrepener: 1872.42305178 hartree
electener: -2784.73703919 hartree
oneelecener: -4958.28049700 hartree
twoeener: 2173.54345782 hartree
cpcmener: -0.01558268 hartree
kineticenergy: 907.79169741 hartree
xcener: -92.068908801583 hartree
chargesum: -0.0000000
charge: -0.429571 -0.391265 -0.236639 0.087935 0.589416 -0.216391 -0.236709 0.258486 -0.274605 -0.295748 0.207436 -0.008174 -0.373060 -0.360666 -0.357949 -0.162395 -0.093341 -0.045146 -0.068133 -0.276322 -0.286820 0.056711 0.086218 0.077341 0.080034 0.088037 0.078595 0.083817 0.083615 0.087614 0.085917 0.080391 0.099126 0.097550 0.094637 0.097868 0.099546 0.093834 0.094674 0.094840 0.097257 0.095071 0.098717 0.094078 0.065229 0.082002 0.077267 0.076450 0.058626 0.054317 0.094312 0.085390 0.079919 0.078916 0.091674 0.080071
qa: -0.4296 -0.3913 -0.2366 0.0879 0.5894 -0.2164 -0.2367 0.2585 -0.2746 -0.2957 0.2074 -0.0082 -0.3731 -0.3607 -0.3579 -0.1624 -0.0933 -0.0451 -0.0681 -0.2763 -0.2868 0.0567 0.0862 0.0773 0.0800 0.0880 0.0786 0.0838 0.0836 0.0876 0.0859 0.0804 0.0991 0.0976 0.0946 0.0979 0.0995 0.0938 0.0947 0.0948 0.0973 0.0951 0.0987 0.0941 0.0652 0.0820 0.0773 0.0765 0.0586 0.0543 0.0943 0.0854 0.0799 0.0789 0.0917 0.0801
va: 1.9889 2.0160 2.8424 3.6839 3.7736 3.9057 3.9413 3.6740 4.0626 4.0311 3.8363 3.9581 3.9459 3.9253 3.9224 3.9185 3.9487 3.9365 3.8269 3.8990 3.9631 1.0169 1.0134 1.0218 1.0187 1.0142 1.0272 1.0168 1.0222 1.0114 1.0029 1.0048 1.0034 1.0048 0.9996 1.0010 1.0024 0.9982 1.0072 1.0063 1.0033 1.0014 0.9959 1.0086 0.9933 0.9956 0.9967 0.9995 1.0092 1.0188 1.0098 0.9997 1.0034 1.0020 1.0037 1.0009
dispcorr: -0.028212935 hartree
energy: -912.342200337073
dipole: 1.72840 -2.21294 -0.48454 -12.38708 11.98446 -0.40261 3.60606 -2.96085 0.64521
magnitude: 0.90176 au
magnitude: 2.29210 debye
