program: Orca
programVersion: 5.0.2
elementType: O O N C C C C C C C C C C C C C C C C C C H H H H H H H H H H H H H H H H H H H H H H H H H H H H H H H H H H H
charge: 0
multiplicity: 1
keywords: wb97x-d3
keywords: def2-TZVPP
keywords: def2/J RIJCOSX
keywords: DEFGRID2
keywords: scfconv7
keywords: smallprint printgap noloewdin
keywords: NOSOSCF
formula: C18H35NO2
InChI: InChI=1/C18H35NO2/c1-6-12-19(7-2)13-16-14-20-18(21-16)10-8-15(9-11-18)17(3,4)5/h15-16H,6-14H2,1-5H3
56 atoms
O  -0.222502 0.604831 0.417141
O  -0.079879 2.850086 0.603633
N  -2.991384 -0.906436 -0.043314
C  3.301907 0.36389 -0.194602
C  0.687145 1.680305 0.364017
C  2.234699 0.551598 -1.278044
C  2.62254 0.278427 1.175902
C  4.28684 -0.802952 -0.475006
C  1.350027 1.76521 -1.005094
C  1.733891 1.48878 1.447939
C  -1.522496 1.10567 0.153515
C  -1.434311 2.489133 0.777694
C  3.589184 -2.16486 -0.491959
C  4.977042 -0.586232 -1.825562
C  5.377678 -0.8257 0.599829
C  -2.602018 0.233061 0.766997
C  -4.327133 -1.369687 0.307065
C  -2.02132 -1.9950 -0.00915
C  -5.444032 -0.516895 -0.277453
C  -2.110887 -2.897951 -1.227838
C  -6.816747 -1.042001 0.113223
H  3.914338 1.278149 -0.190069
H  2.697566 0.68143 -2.257597
H  1.608527 -0.342938 -1.352247
H  2.025107 -0.63546 1.246254
H  3.366212 0.218234 1.972243
H  0.587305 1.861166 -1.78392
H  1.95513 2.676608 -1.04461
H  2.351759 2.390931 1.490215
H  1.241663 1.392609 2.420038
H  -1.699306 1.185063 -0.927654
H  -1.703231 2.463623 1.842013
H  -2.079155 3.21572 0.279975
H  4.308563 -2.959087 -0.706179
H  3.126591 -2.404713 0.467205
H  2.812247 -2.22282 -1.256671
H  5.434248 0.404931 -1.887053
H  4.292223 -0.686862 -2.668719
H  5.771915 -1.320992 -1.973311
H  6.149782 -1.556733 0.348934
H  5.867674 0.147021 0.693976
H  4.991993 -1.097119 1.583459
H  -3.478642 0.874408 0.885356
H  -2.296644 -0.050964 1.788268
H  -4.452183 -2.385624 -0.073413
H  -4.450927 -1.445048 1.401067
H  -1.018175 -1.573191 0.020137
H  -2.122184 -2.594833 0.909973
H  -5.345574 -0.504128 -1.366123
H  -5.351551 0.521473 0.052611
H  -1.934348 -2.332115 -2.143572
H  -1.355254 -3.682885 -1.170342
H  -3.079331 -3.390904 -1.322094
H  -6.950114 -1.044674 1.196906
H  -6.968553 -2.064767 -0.238152
H  -7.612641 -0.429193 -0.311761
elementType: O N C H
totalener: -912.31587129 hartree
nucrepener: 1884.11059577 hartree
electener: -2796.42646706 hartree
oneelecener: -4981.71841494 hartree
twoeener: 2185.29194788 hartree
cpcmener: -0.01526029 hartree
kineticenergy: 907.79630560 hartree
xcener: -92.066838485655 hartree
chargesum: -0.0000000
charge: -0.395759 -0.405660 -0.240270 0.088413 0.571949 -0.236830 -0.227808 0.260128 -0.266577 -0.260221 0.156137 0.022439 -0.373993 -0.360001 -0.358857 -0.134182 -0.101082 -0.046100 -0.061308 -0.266429 -0.280177 0.056775 0.087030 0.079356 0.079035 0.088000 0.084108 0.085433 0.080268 0.080594 0.049707 0.073695 0.094388 0.098312 0.095820 0.095635 0.099340 0.093904 0.094821 0.094169 0.098614 0.093892 0.114979 0.078702 0.096819 0.073159 0.083791 0.070800 0.046606 0.055217 0.072442 0.089845 0.080510 0.078743 0.080466 0.091211
qa: -0.3958 -0.4057 -0.2403 0.0884 0.5719 -0.2368 -0.2278 0.2601 -0.2666 -0.2602 0.1561 0.0224 -0.3740 -0.3600 -0.3589 -0.1342 -0.1011 -0.0461 -0.0613 -0.2664 -0.2802 0.0568 0.0870 0.0794 0.0790 0.0880 0.0841 0.0854 0.0803 0.0806 0.0497 0.0737 0.0944 0.0983 0.0958 0.0956 0.0993 0.0939 0.0948 0.0942 0.0986 0.0939 0.1150 0.0787 0.0968 0.0732 0.0838 0.0708 0.0466 0.0552 0.0724 0.0898 0.0805 0.0787 0.0805 0.0912
va: 1.9935 1.9982 2.8400 3.6874 3.7605 3.9463 3.9322 3.6744 4.0375 4.0508 3.9123 3.9911 3.9458 3.9231 3.9243 3.9144 3.9100 3.8780 3.8470 3.9285 3.9504 1.0173 1.0144 1.0119 1.0146 1.0123 1.0141 1.0197 1.0195 1.0236 1.0301 0.9968 0.9928 1.0041 1.0003 1.0008 1.0024 0.9991 1.0070 1.0070 1.0027 0.9998 0.9870 1.0260 0.9904 1.0057 1.0037 1.0073 1.0222 1.0151 1.0130 1.0078 1.0043 1.0015 1.0006 1.0039
dispcorr: -0.027960404 hartree
energy: -912.343831695422
dipole: 0.49159 -0.93050 -0.43891 -14.42289 14.19996 -0.22293 -3.66034 3.82501 0.16466
magnitude: 0.51909 au
magnitude: 1.31941 debye
