program: Orca
programVersion: 5.0.2
elementType: O O N C C C C C C C C C C C C C C C C C C H H H H H H H H H H H H H H H H H H H H H H H H H H H H H H H H H H H
charge: 0
multiplicity: 1
keywords: wb97x-d3
keywords: def2-TZVPP
keywords: def2/J RIJCOSX
keywords: DEFGRID2
keywords: scfconv7
keywords: smallprint printgap noloewdin
keywords: NOSOSCF
formula: C18H35NO2
InChI: InChI=1/C18H35NO2/c1-6-12-19(7-2)13-16-14-20-18(21-16)10-8-15(9-11-18)17(3,4)5/h15-16H,6-14H2,1-5H3
56 atoms
O  -0.468055 1.097696 -0.678123
O  -0.067423 3.165327 0.069964
N  -3.253091 -0.370597 -0.331724
C  2.883064 0.077961 0.217489
C  0.529541 1.898562 -0.071181
C  2.43844 0.642198 -1.136044
C  1.674433 -0.003539 1.153528
C  3.678364 -1.251492 0.116921
C  1.728291 1.987166 -0.996084
C  0.956002 1.334484 1.284099
C  -1.749502 1.626929 -0.369824
C  -1.424025 2.927165 0.375294
C  2.812577 -2.409686 -0.385392
C  4.868334 -1.077252 -0.831951
C  4.237882 -1.619726 1.494644
C  -2.613411 0.675715 0.44896
C  -2.843653 -1.729624 -0.022455
C  -4.691845 -0.203048 -0.445476
C  -1.525983 -2.130799 -0.671246
C  -5.499128 -0.467251 0.822018
C  -1.154238 -3.574891 -0.373268
H  3.577532 0.812296 0.652607
H  3.298357 0.784454 -1.79231
H  1.779776 -0.067614 -1.645724
H  0.971028 -0.758762 0.79284
H  1.978526 -0.327036 2.150655
H  1.410269 2.355434 -1.97529
H  2.426224 2.724822 -0.588325
H  1.626312 2.061812 1.753548
H  0.094358 1.229262 1.949459
H  -2.262907 1.842979 -1.313237
H  -1.583961 2.825986 1.456862
H  -2.021488 3.770788 0.028209
H  2.002216 -2.647887 0.306074
H  2.36739 -2.201803 -1.360462
H  3.414745 -3.314965 -0.495131
H  4.561928 -0.958345 -1.872247
H  5.523409 -1.950729 -0.79206
H  5.471584 -0.205804 -0.563503
H  3.454995 -1.851643 2.218223
H  4.879053 -2.501703 1.426777
H  4.841863 -0.808665 1.909822
H  -3.373853 1.288616 0.948134
H  -2.00747 0.25344 1.2591
H  -2.783162 -1.911707 1.062607
H  -3.619103 -2.40542 -0.395099
H  -4.888037 0.815194 -0.793229
H  -5.052013 -0.861061 -1.241449
H  -0.722722 -1.47668 -0.328762
H  -1.606365 -1.980523 -1.751366
H  -5.186931 0.174657 1.648187
H  -6.559099 -0.27618 0.644488
H  -5.405767 -1.502976 1.153235
H  -1.007693 -3.739402 0.696347
H  -0.227859 -3.856994 -0.876044
H  -1.92946 -4.267635 -0.708387
elementType: O N C H
totalener: -912.31109558 hartree
nucrepener: 1938.79376104 hartree
electener: -2851.10485662 hartree
oneelecener: -5091.26302138 hartree
twoeener: 2240.15816476 hartree
cpcmener: -0.01763274 hartree
kineticenergy: 907.78857600 hartree
xcener: -92.069497598916 hartree
chargesum: 0.0000000
charge: -0.401844 -0.385362 -0.224760 0.101171 0.552346 -0.216080 -0.254538 0.273600 -0.261595 -0.280148 0.211773 -0.029938 -0.397550 -0.357431 -0.360913 -0.171286 -0.098579 -0.052876 -0.008129 -0.273744 -0.311338 0.056617 0.087875 0.075998 0.079614 0.094398 0.077243 0.083508 0.087431 0.090520 0.076837 0.078641 0.105441 0.090556 0.102457 0.102527 0.094036 0.094906 0.099571 0.094737 0.094679 0.097652 0.099114 0.105029 0.070739 0.079849 0.078070 0.073812 -0.000678 0.056482 0.080643 0.093581 0.082746 0.083447 0.091125 0.088016
qa: -0.4018 -0.3854 -0.2248 0.1012 0.5523 -0.2161 -0.2545 0.2736 -0.2616 -0.2801 0.2118 -0.0299 -0.3975 -0.3574 -0.3609 -0.1713 -0.0986 -0.0529 -0.0081 -0.2737 -0.3113 0.0566 0.0879 0.0760 0.0796 0.0944 0.0772 0.0835 0.0874 0.0905 0.0768 0.0786 0.1054 0.0906 0.1025 0.1025 0.0940 0.0949 0.0996 0.0947 0.0947 0.0977 0.0991 0.1050 0.0707 0.0798 0.0781 0.0738 -0.0007 0.0565 0.0806 0.0936 0.0827 0.0834 0.0911 0.0880
va: 1.9796 2.0189 2.8630 3.6715 3.7981 3.9156 3.9957 3.6669 4.0367 4.0073 3.8834 3.9863 3.9595 3.9236 3.9234 3.8942 3.9536 3.9618 3.7995 3.8892 3.9616 1.0169 1.0129 1.0189 0.9918 1.0149 1.0320 1.0169 1.0231 1.0127 1.0141 0.9981 0.9945 0.9929 0.9977 1.0067 0.9979 1.0076 1.0021 1.0003 1.0066 1.0032 0.9955 0.9988 0.9943 0.9986 0.9950 0.9981 1.0369 1.0279 1.0031 1.0104 1.0010 0.9986 1.0034 1.0046
dispcorr: -0.030915909 hartree
energy: -912.342011487897
dipole: 3.08758 -3.72998 -0.64240 -18.18026 17.99285 -0.18740 3.71526 -2.84430 0.87096
magnitude: 1.09834 au
magnitude: 2.79177 debye
