program: Orca
programVersion: 5.0.2
elementType: O O N C C C C C C C C C C C C C C C C C C H H H H H H H H H H H H H H H H H H H H H H H H H H H H H H H H H H H
charge: 0
multiplicity: 1
keywords: wb97x-d3
keywords: def2-TZVPP
keywords: def2/J RIJCOSX
keywords: DEFGRID2
keywords: scfconv7
keywords: smallprint printgap noloewdin
keywords: NOSOSCF
formula: C18H35NO2
InChI: InChI=1/C18H35NO2/c1-6-12-19(7-2)13-16-14-20-18(21-16)10-8-15(9-11-18)17(3,4)5/h15-16H,6-14H2,1-5H3
56 atoms
O  -0.444049 0.920746 -0.744407
O  -0.35966 2.944074 0.256769
N  -2.755967 -0.477365 0.234616
C  2.778454 0.029897 0.404621
C  0.379968 1.759923 0.044539
C  2.474806 0.739955 -0.919415
C  1.478458 -0.185838 1.186863
C  3.62018 -1.264863 0.242657
C  1.671238 2.022831 -0.716858
C  0.69225 1.106105 1.381882
C  -1.727855 1.495643 -0.875776
C  -1.42577 2.972531 -0.671555
C  2.836998 -2.380973 -0.45333
C  4.884468 -0.969671 -0.571254
C  4.066296 -1.764721 1.620251
C  -2.72709 0.963282 0.148584
C  -3.245172 -1.155895 -0.957263
C  -3.306624 -0.970236 1.48263
C  -2.149646 -1.855149 -1.759678
C  -4.775438 -0.653898 1.748624
C  -1.433362 -2.946264 -0.979354
H  3.39706 0.721373 0.996087
H  3.402097 0.999895 -1.432283
H  1.931121 0.071821 -1.594002
H  0.842117 -0.909366 0.669105
H  1.688754 -0.61444 2.168316
H  1.448938 2.488673 -1.681597
H  2.268753 2.74089 -0.146404
H  1.273944 1.807087 1.988896
H  -0.234848 0.90709 1.926521
H  -2.084537 1.294776 -1.889799
H  -2.256699 3.536148 -0.242702
H  -1.132543 3.455884 -1.610906
H  1.983619 -2.720007 0.137019
H  2.458653 -2.076561 -1.431421
H  3.478231 -3.251057 -0.614262
H  5.440864 -0.12528 -0.155931
H  4.667732 -0.741816 -1.615764
H  5.553003 -1.833671 -0.566807
H  4.719268 -2.635035 1.521325
H  4.626029 -0.997143 2.161071
H  3.228125 -2.067055 2.249734
H  -3.705822 1.403295 -0.109459
H  -2.468236 1.356748 1.136874
H  -3.988989 -1.907538 -0.672095
H  -3.78096 -0.45589 -1.610903
H  -3.162792 -2.053429 1.511572
H  -2.702766 -0.568184 2.302394
H  -1.421798 -1.125125 -2.11958
H  -2.610304 -2.288795 -2.652356
H  -5.090971 -1.096038 2.695594
H  -4.957397 0.420138 1.815585
H  -5.426884 -1.055162 0.969513
H  -2.125405 -3.72825 -0.658491
H  -0.949718 -2.546032 -0.087268
H  -0.65912 -3.42328 -1.58275
elementType: O N C H
totalener: -912.31069117 hartree
nucrepener: 1966.36464501 hartree
electener: -2878.67533618 hartree
oneelecener: -5146.88593066 hartree
twoeener: 2268.21059448 hartree
cpcmener: -0.01670448 hartree
kineticenergy: 907.79568392 hartree
xcener: -92.072182361042 hartree
chargesum: -0.0000000
charge: -0.406257 -0.403285 -0.211743 0.096686 0.560361 -0.226827 -0.203655 0.261377 -0.263130 -0.279505 0.233093 -0.003603 -0.380620 -0.356809 -0.360791 -0.239696 -0.101441 -0.046564 -0.099464 -0.274948 -0.289511 0.057292 0.085571 0.078071 0.040098 0.087909 0.079419 0.077658 0.091092 0.083421 0.095865 0.098522 0.085924 0.089994 0.099726 0.100235 0.099056 0.093908 0.094670 0.094922 0.096239 0.095722 0.090582 0.106053 0.089572 0.088946 0.078832 0.071045 0.059951 0.066263 0.093770 0.083528 0.080469 0.091330 0.073980 0.096699
qa: -0.4063 -0.4033 -0.2117 0.0967 0.5604 -0.2268 -0.2037 0.2614 -0.2631 -0.2795 0.2331 -0.0036 -0.3806 -0.3568 -0.3608 -0.2397 -0.1014 -0.0466 -0.0995 -0.2749 -0.2895 0.0573 0.0856 0.0781 0.0401 0.0879 0.0794 0.0777 0.0911 0.0834 0.0959 0.0985 0.0859 0.0900 0.0997 0.1002 0.0991 0.0939 0.0947 0.0949 0.0962 0.0957 0.0906 0.1061 0.0896 0.0889 0.0788 0.0710 0.0600 0.0663 0.0938 0.0835 0.0805 0.0913 0.0740 0.0967
va: 1.9914 1.9978 2.7730 3.6960 3.8137 3.9277 3.9758 3.6784 4.0544 4.0279 3.7752 4.0331 3.9508 3.9252 3.9221 3.9773 3.8842 3.9271 3.8727 3.9107 3.9156 1.0157 1.0118 1.0181 1.0276 1.0158 1.0186 1.0201 1.0180 1.0158 0.9936 0.9937 0.9954 0.9972 1.0000 1.0064 1.0021 0.9972 1.0077 1.0059 1.0034 1.0007 1.0049 0.9926 0.9980 1.0057 0.9931 0.9999 1.0127 1.0171 1.0099 0.9992 1.0035 1.0022 1.0035 1.0062
dispcorr: -0.031709505 hartree
energy: -912.342400678287
dipole: 3.24482 -3.99806 -0.75324 -16.04959 16.17019 0.12060 1.48774 -1.69167 -0.20394
magnitude: 0.78962 au
magnitude: 2.00706 debye
