program: Orca
programVersion: 5.0.2
elementType: O O N C C C C C C C C C C C C C C C C C C H H H H H H H H H H H H H H H H H H H H H H H H H H H H H H H H H H H
charge: 0
multiplicity: 1
keywords: wb97x-d3
keywords: def2-TZVPP
keywords: def2/J RIJCOSX
keywords: DEFGRID2
keywords: scfconv7
keywords: smallprint printgap noloewdin
keywords: NOSOSCF
formula: C18H35NO2
InChI: InChI=1/C18H35NO2/c1-6-12-19(7-2)13-16-14-20-18(21-16)10-8-15(9-11-18)17(3,4)5/h15-16H,6-14H2,1-5H3
56 atoms
O  -0.296519 1.215882 -0.73305
O  -0.2685 2.534381 1.096031
N  -2.660389 -0.421929 -0.06273
C  3.027021 0.04667 0.018657
C  0.497484 1.594155 0.380033
C  2.690036 1.27469 -0.833626
C  1.724575 -0.613477 0.481631
C  4.022234 -0.934688 -0.6584
C  1.780355 2.254433 -0.097007
C  0.821635 0.366781 1.22526
C  -1.600405 1.760137 -0.613377
C  -1.628774 2.274878 0.817882
C  3.432943 -1.593583 -1.906763
C  5.299735 -0.187925 -1.05689
C  4.419947 -2.031394 0.334291
C  -2.673462 0.731797 -0.941727
C  -3.916894 -0.636718 0.633044
C  -2.077246 -1.609536 -0.665398
C  -3.82311 -1.621812 1.788699
C  -2.94573 -2.349068 -1.678505
C  -5.138282 -1.714122 2.548295
H  3.536759 0.416655 0.920859
H  3.598871 1.807428 -1.11791
H  2.212015 0.966156 -1.768516
H  1.185603 -1.023381 -0.377892
H  1.930248 -1.458002 1.141462
H  1.537238 3.106043 -0.738974
H  2.308829 2.652993 0.774836
H  1.325129 0.702053 2.137638
H  -0.101906 -0.130282 1.535443
H  -1.710356 2.596341 -1.317691
H  -2.04514 1.531615 1.506759
H  -2.195707 3.200787 0.922874
H  4.169627 -2.251987 -2.373735
H  2.557087 -2.204423 -1.680253
H  3.138115 -0.85973 -2.659384
H  5.136163 0.521517 -1.869319
H  6.063506 -0.890316 -1.398976
H  5.720305 0.366053 -0.21342
H  5.191359 -2.676047 -0.093445
H  4.824175 -1.60771 1.257401
H  3.582874 -2.676091 0.60578
H  -2.573514 0.444829 -1.995255
H  -3.634817 1.251573 -0.8804
H  -4.233705 0.32766 1.040715
H  -4.727506 -0.955589 -0.043702
H  -1.144206 -1.313523 -1.147046
H  -1.786106 -2.304174 0.126867
H  -3.022825 -1.305755 2.46429
H  -3.550267 -2.617174 1.428036
H  -3.839604 -2.779164 -1.223499
H  -3.26827 -1.698853 -2.494427
H  -2.381146 -3.171405 -2.121492
H  -5.069889 -2.421081 3.375968
H  -5.950369 -2.049609 1.899926
H  -5.428973 -0.748094 2.966034
elementType: O N C H
totalener: -912.31251893 hartree
nucrepener: 1926.80084905 hartree
electener: -2839.11336798 hartree
oneelecener: -5067.49390429 hartree
twoeener: 2228.38053631 hartree
cpcmener: -0.01499539 hartree
kineticenergy: 907.78995656 hartree
xcener: -92.072922969715 hartree
chargesum: -0.0000000
charge: -0.427885 -0.393959 -0.216832 0.103611 0.588246 -0.216842 -0.269167 0.266630 -0.279974 -0.272902 0.208455 -0.021417 -0.379955 -0.358603 -0.360788 -0.118568 -0.126392 -0.086131 -0.061135 -0.278763 -0.283506 0.056541 0.087344 0.076003 0.087489 0.088771 0.077906 0.082381 0.088235 0.073276 0.070737 0.073596 0.103766 0.098498 0.093234 0.099088 0.093783 0.094250 0.099690 0.095030 0.097306 0.094937 0.091337 0.089578 0.089197 0.082308 0.083642 0.085342 0.058656 0.061797 0.083663 0.082593 0.094159 0.091812 0.079687 0.080243
qa: -0.4279 -0.3940 -0.2168 0.1036 0.5882 -0.2168 -0.2692 0.2666 -0.2800 -0.2729 0.2085 -0.0214 -0.3800 -0.3586 -0.3608 -0.1186 -0.1264 -0.0861 -0.0611 -0.2788 -0.2835 0.0565 0.0873 0.0760 0.0875 0.0888 0.0779 0.0824 0.0882 0.0733 0.0707 0.0736 0.1038 0.0985 0.0932 0.0991 0.0938 0.0942 0.0997 0.0950 0.0973 0.0949 0.0913 0.0896 0.0892 0.0823 0.0836 0.0853 0.0587 0.0618 0.0837 0.0826 0.0942 0.0918 0.0797 0.0802
va: 1.9800 2.0051 2.8301 3.6698 3.7671 3.9077 3.9764 3.6688 4.0703 4.0008 3.8849 3.9757 3.9478 3.9229 3.9232 3.9333 3.9118 3.9402 3.8412 3.9263 3.9589 1.0176 1.0131 1.0224 0.9945 1.0146 1.0251 1.0169 1.0245 1.0352 1.0040 1.0101 0.9935 1.0050 1.0009 1.0000 0.9987 1.0074 1.0022 1.0063 1.0032 1.0001 1.0041 1.0058 0.9925 0.9928 1.0026 0.9882 1.0144 1.0072 0.9979 1.0033 1.0089 1.0033 1.0016 1.0006
dispcorr: -0.030185103 hartree
energy: -912.342704033922
dipole: 1.02056 -1.81678 -0.79621 -16.21984 15.84179 -0.37805 -1.40858 1.22457 -0.18401
magnitude: 0.90041 au
magnitude: 2.28866 debye
