program: Orca
programVersion: 5.0.2
elementType: O O N C C C C C C C C C C C C C C C C C C H H H H H H H H H H H H H H H H H H H H H H H H H H H H H H H H H H H
charge: 0
multiplicity: 1
keywords: wb97x-d3
keywords: def2-TZVPP
keywords: def2/J RIJCOSX
keywords: DEFGRID2
keywords: scfconv7
keywords: smallprint printgap noloewdin
keywords: NOSOSCF
formula: C18H35NO2
InChI: InChI=1/C18H35NO2/c1-6-12-19(7-2)13-16-14-20-18(21-16)10-8-15(9-11-18)17(3,4)5/h15-16H,6-14H2,1-5H3
56 atoms
O  0.009439 0.201062 -0.800636
O  -0.341323 2.258076 0.026565
N  -3.3921 -0.750876 0.281124
C  3.476722 0.376054 0.209408
C  0.651394 1.274158 -0.128222
C  2.913592 0.807673 -1.148656
C  2.334592 -0.196974 1.054283
C  4.722509 -0.543886 0.120454
C  1.773438 1.812548 -0.997315
C  1.201104 0.810899 1.22003
C  -1.396408 0.318791 -0.643875
C  -1.564164 1.574712 0.210411
C  4.396903 -1.900136 -0.506927
C  5.814674 0.135098 -0.712462
C  5.294034 -0.772646 1.523749
C  -1.977035 -0.924896 0.008793
C  -4.220503 -0.974026 -0.896756
C  -3.835745 -1.549249 1.415466
C  -5.498103 -0.145632 -0.884942
C  -3.413222 -0.976673 2.756767
C  -6.383133 -0.438502 -2.086008
H  3.8193 1.291455 0.715121
H  3.689218 1.268947 -1.761689
H  2.56113 -0.065268 -1.706702
H  1.944046 -1.109852 0.594231
H  2.688292 -0.481987 2.046499
H  1.3746 2.090289 -1.976906
H  2.158668 2.727635 -0.536858
H  1.57497 1.689738 1.75503
H  0.403117 0.384343 1.835537
H  -1.837261 0.472819 -1.635736
H  -1.73698 1.327567 1.265241
H  -2.380265 2.215623 -0.122507
H  3.989502 -1.801439 -1.515119
H  5.299505 -2.511261 -0.585146
H  3.677425 -2.467652 0.086244
H  6.744736 -0.435947 -0.662916
H  6.030658 1.141951 -0.345527
H  5.54962 0.21678 -1.767555
H  5.512459 0.173794 2.025405
H  4.618393 -1.338337 2.166711
H  6.228299 -1.336712 1.472078
H  -1.446512 -1.081955 0.950783
H  -1.776957 -1.813435 -0.610799
H  -3.650391 -0.705257 -1.789303
H  -4.466954 -2.042318 -1.015227
H  -4.926283 -1.593917 1.395204
H  -3.490959 -2.592626 1.330037
H  -5.228437 0.913938 -0.870064
H  -6.062164 -0.3315 0.033366
H  -3.814272 0.027918 2.897138
H  -3.790697 -1.602968 3.566503
H  -2.329376 -0.924957 2.872084
H  -5.863563 -0.237593 -3.025348
H  -7.284401 0.175731 -2.074255
H  -6.700534 -1.483075 -2.104085
elementType: O N C H
totalener: -912.31573326 hartree
nucrepener: 1872.97751860 hartree
electener: -2785.29325186 hartree
oneelecener: -4959.31158795 hartree
twoeener: 2174.01833609 hartree
cpcmener: -0.01582143 hartree
kineticenergy: 907.79184792 hartree
xcener: -92.066936751189 hartree
chargesum: 0.0000000
charge: -0.429451 -0.390536 -0.240731 0.088014 0.579586 -0.217589 -0.240483 0.260539 -0.269596 -0.298804 0.260113 -0.026486 -0.372247 -0.358405 -0.357835 -0.216504 -0.088783 -0.048042 -0.068816 -0.268271 -0.280692 0.055308 0.088483 0.076763 0.080055 0.088441 0.077974 0.083225 0.086355 0.088214 0.084260 0.078773 0.102025 0.097686 0.097481 0.093911 0.094498 0.099289 0.093368 0.097872 0.093881 0.094493 0.111442 0.094699 0.089938 0.076224 0.085832 0.070076 0.049043 0.056473 0.076022 0.095581 0.077488 0.079846 0.090954 0.079047
qa: -0.4295 -0.3905 -0.2407 0.0880 0.5796 -0.2176 -0.2405 0.2605 -0.2696 -0.2988 0.2601 -0.0265 -0.3722 -0.3584 -0.3578 -0.2165 -0.0888 -0.0480 -0.0688 -0.2683 -0.2807 0.0553 0.0885 0.0768 0.0801 0.0884 0.0780 0.0832 0.0864 0.0882 0.0843 0.0788 0.1020 0.0977 0.0975 0.0939 0.0945 0.0993 0.0934 0.0979 0.0939 0.0945 0.1114 0.0947 0.0899 0.0762 0.0858 0.0701 0.0490 0.0565 0.0760 0.0956 0.0775 0.0798 0.0910 0.0790
va: 1.9873 2.0183 2.8099 3.6791 3.7838 3.9055 3.9425 3.6719 4.0578 4.0242 3.7458 3.9890 3.9463 3.9250 3.9236 4.0044 3.9083 3.8838 3.8601 3.9269 3.9529 1.0178 1.0127 1.0225 1.0174 1.0137 1.0293 1.0167 1.0228 1.0107 1.0030 1.0022 0.9955 1.0006 1.0045 1.0001 1.0072 1.0024 0.9992 1.0032 1.0012 1.0065 0.9871 1.0161 0.9982 1.0055 0.9902 1.0068 1.0172 1.0126 1.0107 1.0106 1.0021 1.0004 1.0037 1.0015
dispcorr: -0.028390912 hartree
energy: -912.344124170410
dipole: 1.00996 -1.48724 -0.47728 -9.54608 8.89015 -0.65593 2.63992 -2.27845 0.36147
magnitude: 0.88809 au
magnitude: 2.25735 debye
