program: Orca
programVersion: 5.0.2
elementType: O O N C C C C C C C C C C C C C C C C C C H H H H H H H H H H H H H H H H H H H H H H H H H H H H H H H H H H H
charge: 0
multiplicity: 1
keywords: wb97x-d3
keywords: def2-TZVPP
keywords: def2/J RIJCOSX
keywords: DEFGRID2
keywords: scfconv7
keywords: smallprint printgap noloewdin
keywords: NOSOSCF
formula: C18H35NO2
InChI: InChI=1/C18H35NO2/c1-6-12-19(7-2)13-16-14-20-18(21-16)10-8-15(9-11-18)17(3,4)5/h15-16H,6-14H2,1-5H3
56 atoms
O  -0.43922 0.867525 -0.648395
O  -0.237014 2.890861 0.340231
N  -3.275596 -0.34472 0.041699
C  2.992104 0.113077 0.196747
C  0.47434 1.71131 0.039151
C  2.502343 0.733919 -1.115596
C  1.782714 -0.176668 1.091181
C  3.936297 -1.104015 0.010671
C  1.666458 1.988173 -0.868472
C  0.941414 1.071287 1.338009
C  -1.721632 1.476307 -0.697741
C  -1.368114 2.945128 -0.502685
C  3.234198 -2.288703 -0.655401
C  5.142381 -0.701346 -0.844703
C  4.46931 -1.55387 1.375037
C  -2.704618 0.955674 0.347921
C  -2.376738 -1.454267 0.336885
C  -4.565167 -0.522648 0.698682
C  -2.647713 -2.684637 -0.520086
C  -5.697771 0.248653 0.043263
C  -1.67639 -3.815234 -0.21526
H  3.592361 0.881215 0.707189
H  3.344561 1.007206 -1.753283
H  1.9125 0.006155 -1.681309
H  1.158415 -0.952462 0.637125
H  2.099388 -0.569657 2.058783
H  1.322244 2.410969 -1.817172
H  2.291392 2.748087 -0.388948
H  1.537998 1.806847 1.887105
H  0.076775 0.832916 1.963871
H  -2.146309 1.297795 -1.689804
H  -2.149283 3.5269 -0.01055
H  -1.138241 3.426134 -1.461446
H  2.39618 -2.659023 -0.061776
H  2.852145 -2.039292 -1.647263
H  3.929051 -3.122863 -0.780029
H  5.876046 -1.510515 -0.876743
H  5.646257 0.17981 -0.437583
H  4.87031 -0.478644 -1.877812
H  5.226501 -2.332562 1.256137
H  4.935507 -0.725463 1.915103
H  3.688667 -1.96647 2.015762
H  -3.522191 1.679092 0.367717
H  -2.249696 0.989729 1.352175
H  -1.351417 -1.137506 0.150954
H  -2.415489 -1.729547 1.405359
H  -4.820543 -1.583047 0.664736
H  -4.508838 -0.262519 1.769183
H  -2.566947 -2.402111 -1.573225
H  -3.671988 -3.039466 -0.374259
H  -5.55301 1.330129 0.078277
H  -5.813559 -0.040228 -1.002678
H  -6.637714 0.037606 0.556235
H  -1.745367 -4.134667 0.826721
H  -0.642786 -3.51214 -0.397335
H  -1.874456 -4.689216 -0.837376
elementType: O N C H
totalener: -912.31324318 hartree
nucrepener: 1919.43533565 hartree
electener: -2831.74857883 hartree
oneelecener: -5052.46775434 hartree
twoeener: 2220.71917551 hartree
cpcmener: -0.01538438 hartree
kineticenergy: 907.77310472 hartree
xcener: -92.062931965608 hartree
chargesum: 0.0000000
charge: -0.421135 -0.401230 -0.232472 0.094548 0.573141 -0.227888 -0.235512 0.268693 -0.269621 -0.285279 0.247340 -0.006256 -0.380822 -0.356941 -0.363044 -0.228011 -0.057740 -0.046983 -0.065524 -0.260525 -0.281354 0.057230 0.087460 0.077623 0.079127 0.089414 0.081122 0.077867 0.091205 0.084377 0.077283 0.090807 0.087475 0.092929 0.099024 0.098938 0.094737 0.099460 0.093510 0.095516 0.098260 0.095023 0.105042 0.105094 0.057975 0.072956 0.091337 0.066901 0.045209 0.057915 0.077554 0.072680 0.089385 0.079027 0.075245 0.091908
qa: -0.4211 -0.4012 -0.2325 0.0945 0.5731 -0.2279 -0.2355 0.2687 -0.2696 -0.2853 0.2473 -0.0063 -0.3808 -0.3569 -0.3630 -0.2280 -0.0577 -0.0470 -0.0655 -0.2605 -0.2814 0.0572 0.0875 0.0776 0.0791 0.0894 0.0811 0.0779 0.0912 0.0844 0.0773 0.0908 0.0875 0.0929 0.0990 0.0989 0.0947 0.0995 0.0935 0.0955 0.0983 0.0950 0.1050 0.1051 0.0580 0.0730 0.0913 0.0669 0.0452 0.0579 0.0776 0.0727 0.0894 0.0790 0.0752 0.0919
va: 1.9808 1.9964 2.8498 3.6756 3.8020 3.9274 3.9647 3.6691 4.0546 4.0034 3.7623 4.0193 3.9516 3.9216 3.9229 3.9973 3.8941 3.8679 3.8503 3.9309 3.9604 1.0168 1.0120 1.0210 0.9942 1.0143 1.0178 1.0212 1.0197 1.0229 1.0222 0.9953 0.9946 0.9988 1.0002 1.0053 1.0072 1.0023 0.9991 1.0067 1.0029 0.9996 0.9961 1.0067 1.0230 1.0074 0.9865 1.0082 1.0222 1.0141 1.0046 1.0138 1.0073 1.0008 0.9993 1.0045
dispcorr: -0.029325207 hartree
energy: -912.342568388213
dipole: 3.68417 -3.99289 -0.30872 -15.82833 15.93679 0.10846 1.17984 -1.00081 0.17903
magnitude: 0.37299 au
magnitude: 0.94807 debye
