program: Orca
programVersion: 5.0.2
elementType: O O N C C C C C C C C C C C C C C C C C C H H H H H H H H H H H H H H H H H H H H H H H H H H H H H H H H H H H
charge: 0
multiplicity: 1
keywords: wb97x-d3
keywords: def2-TZVPP
keywords: def2/J RIJCOSX
keywords: DEFGRID2
keywords: scfconv7
keywords: smallprint printgap noloewdin
keywords: NOSOSCF
formula: C18H35NO2
InChI: InChI=1/C18H35NO2/c1-6-12-19(7-2)13-16-14-20-18(21-16)10-8-15(9-11-18)17(3,4)5/h15-16H,6-14H2,1-5H3
56 atoms
O  -0.380583 0.658346 -0.333032
O  -0.263417 2.67676 0.666338
N  -3.16986 -0.727492 0.280979
C  3.179591 0.249925 0.014469
C  0.524038 1.591563 0.240561
C  2.463298 0.84922 -1.200141
C  2.132133 -0.176296 1.04835
C  4.204508 -0.860892 -0.337233
C  1.553162 2.009309 -0.804496
C  1.221465 0.981012 1.444046
C  -1.683346 1.223712 -0.41755
C  -1.421369 2.701066 -0.139743
C  5.253016 -0.310363 -1.309751
C  4.941235 -1.303793 0.931057
C  3.541605 -2.084852 -0.971017
C  -2.653361 0.59195 0.584008
C  -4.03183 -0.754567 -0.889718
C  -2.207794 -1.815959 0.283106
C  -5.158219 -1.779345 -0.792695
C  -1.536239 -2.039868 1.625434
C  -6.09974 -1.528936 0.37424
H  3.765656 1.062128 0.470134
H  3.184193 1.216118 -1.932501
H  1.87231 0.080994 -1.708438
H  1.525896 -0.998906 0.655747
H  2.611098 -0.555329 1.952562
H  1.051237 2.414165 -1.688639
H  2.159664 2.818657 -0.38546
H  1.817469 1.760355 1.929742
H  0.47426 0.65153 2.171815
H  -2.058624 1.085242 -1.436763
H  -2.225579 3.190441 0.412148
H  -1.259225 3.261777 -1.068068
H  4.836605 -0.085185 -2.292522
H  5.711777 0.605293 -0.927154
H  6.054524 -1.036608 -1.463229
H  5.384767 -0.453111 1.455231
H  5.751675 -1.99355 0.68415
H  4.289276 -1.821523 1.635907
H  2.8117 -2.550474 -0.30601
H  3.030614 -1.841507 -1.904556
H  4.290708 -2.845137 -1.205365
H  -3.518014 1.258016 0.663812
H  -2.190704 0.589617 1.575831
H  -4.488139 0.233228 -1.002501
H  -3.464719 -0.930641 -1.817788
H  -2.750162 -2.730101 0.030535
H  -1.441751 -1.707515 -0.499752
H  -4.752718 -2.793073 -0.731012
H  -5.718675 -1.742593 -1.731213
H  -0.911536 -1.20174 1.93457
H  -2.273366 -2.216093 2.410588
H  -0.89021 -2.917684 1.57217
H  -6.549342 -0.535062 0.314278
H  -5.582484 -1.597985 1.331079
H  -6.914235 -2.255052 0.388824
elementType: O N C H
totalener: -912.31215903 hartree
nucrepener: 1917.99746151 hartree
electener: -2830.30962054 hartree
oneelecener: -5049.60794895 hartree
twoeener: 2219.29832841 hartree
cpcmener: -0.01544387 hartree
kineticenergy: 907.78843023 hartree
xcener: -92.070602688617 hartree
chargesum: 0.0000000
charge: -0.411040 -0.394772 -0.210551 0.100686 0.588870 -0.230224 -0.237570 0.266588 -0.276130 -0.317160 0.190405 -0.005713 -0.358794 -0.361327 -0.377367 -0.200949 -0.091140 -0.068312 -0.099923 -0.285878 -0.268551 0.057399 0.087764 0.077146 0.082186 0.089666 0.081638 0.078922 0.096224 0.093770 0.100937 0.092430 0.086805 0.093418 0.099482 0.094911 0.098370 0.094843 0.094782 0.094565 0.097298 0.097833 0.087673 0.114253 0.088947 0.085715 0.093567 0.064396 0.058010 0.065733 0.073027 0.092133 0.096009 0.076791 0.071477 0.090732
qa: -0.4110 -0.3948 -0.2106 0.1007 0.5889 -0.2302 -0.2376 0.2666 -0.2761 -0.3172 0.1904 -0.0057 -0.3588 -0.3613 -0.3774 -0.2009 -0.0911 -0.0683 -0.0999 -0.2859 -0.2686 0.0574 0.0878 0.0771 0.0822 0.0897 0.0816 0.0789 0.0962 0.0938 0.1009 0.0924 0.0868 0.0934 0.0995 0.0949 0.0984 0.0948 0.0948 0.0946 0.0973 0.0978 0.0877 0.1143 0.0889 0.0857 0.0936 0.0644 0.0580 0.0657 0.0730 0.0921 0.0960 0.0768 0.0715 0.0907
va: 1.9682 2.0063 2.8501 3.6703 3.7784 3.9342 3.9375 3.6669 4.0541 4.0247 3.6971 4.0201 3.9228 3.9233 3.9472 4.0195 3.9003 3.8954 3.8687 3.9168 3.9189 1.0175 1.0123 1.0218 1.0010 1.0146 1.0142 1.0214 1.0203 1.0141 0.9984 0.9963 0.9947 0.9996 1.0023 1.0071 1.0029 1.0068 0.9994 1.0011 1.0001 1.0049 1.0062 0.9954 0.9928 1.0044 0.9881 1.0098 1.0101 1.0144 1.0022 1.0133 1.0050 1.0011 1.0230 1.0064
dispcorr: -0.030225925 hartree
energy: -912.342384955007
dipole: 3.41858 -3.52953 -0.11095 -13.51939 13.75188 0.23249 -1.02002 0.37521 -0.64481
magnitude: 0.69436 au
magnitude: 1.76493 debye
