program: Orca
programVersion: 5.0.2
elementType: O O N C C C C C C C C C C C C C C C C C C H H H H H H H H H H H H H H H H H H H H H H H H H H H H H H H H H H H
charge: 0
multiplicity: 1
keywords: wb97x-d3
keywords: def2-TZVPP
keywords: def2/J RIJCOSX
keywords: DEFGRID2
keywords: scfconv7
keywords: smallprint printgap noloewdin
keywords: NOSOSCF
formula: C18H35NO2
InChI: InChI=1/C18H35NO2/c1-6-12-19(7-2)13-16-14-20-18(21-16)10-8-15(9-11-18)17(3,4)5/h15-16H,6-14H2,1-5H3
56 atoms
O  -0.414336 0.521803 -0.297691
O  -0.40985 2.429174 0.907089
N  -3.093376 -1.10789 0.168476
C  3.150977 0.247972 0.02793
C  0.435877 1.436798 0.377875
C  2.414556 0.9453 -1.120758
C  2.122663 -0.32368 1.009162
C  4.210252 -0.789038 -0.432048
C  1.444852 2.010544 -0.611376
C  1.162595 0.744902 1.518641
C  -1.750773 1.005567 -0.311315
C  -1.578105 2.460322 0.115788
C  3.573779 -2.006147 -1.106059
C  5.190684 -0.141046 -1.414629
C  5.020503 -1.263743 0.778855
C  -2.661287 0.200814 0.620827
C  -3.956329 -1.076712 -0.999847
C  -2.051226 -2.113565 0.032981
C  -5.240527 -0.276299 -0.819931
C  -1.325304 -2.429635 1.328508
C  -6.061815 -0.70279 0.386452
H  3.70867 1.029538 0.565587
H  3.122588 1.427273 -1.796811
H  1.869137 0.210996 -1.721625
H  1.550084 -1.12214 0.527651
H  2.616478 -0.779204 1.86914
H  0.924416 2.480991 -1.451209
H  2.010833 2.799776 -0.106349
H  1.721169 1.499741 2.081188
H  0.434087 0.309219 2.208319
H  -2.127301 0.953312 -1.337604
H  -2.404405 2.839757 0.719302
H  -1.461545 3.120143 -0.752159
H  4.347004 -2.694521 -1.455884
H  2.931782 -2.567935 -0.425234
H  2.973197 -1.731199 -1.975544
H  5.616473 0.780637 -1.00918
H  4.7273 0.101279 -2.372107
H  6.022151 -0.817294 -1.626246
H  4.414405 -1.809901 1.503089
H  5.822912 -1.935811 0.465544
H  5.483774 -0.423868 1.303243
H  -3.557763 0.799421 0.802697
H  -2.177297 0.104273 1.597185
H  -3.43946 -0.716153 -1.904504
H  -4.236849 -2.111685 -1.217258
H  -2.541575 -3.031339 -0.303327
H  -1.318397 -1.869308 -0.750425
H  -5.829334 -0.41485 -1.730533
H  -5.031566 0.795682 -0.769427
H  -0.633876 -3.257892 1.167099
H  -0.739234 -1.593443 1.708394
H  -2.026814 -2.729366 2.108903
H  -5.550725 -0.492829 1.326192
H  -6.272947 -1.773844 0.361966
H  -7.019516 -0.181164 0.412329
elementType: O N C H
totalener: -912.31226200 hartree
nucrepener: 1929.43061146 hartree
electener: -2841.74287346 hartree
oneelecener: -5072.40461848 hartree
twoeener: 2230.66174502 hartree
cpcmener: -0.01587970 hartree
kineticenergy: 907.78762302 hartree
xcener: -92.073181558902 hartree
chargesum: -0.0000000
charge: -0.409171 -0.396713 -0.196409 0.102531 0.580029 -0.228303 -0.246718 0.266106 -0.273292 -0.307734 0.198083 -0.004656 -0.378524 -0.358073 -0.359656 -0.238873 -0.108207 -0.057931 -0.088027 -0.282223 -0.286020 0.056984 0.086647 0.077168 0.082597 0.090662 0.081345 0.078957 0.096307 0.093103 0.103305 0.092757 0.087269 0.097888 0.093197 0.098963 0.099115 0.093254 0.094998 0.095513 0.094785 0.096745 0.097250 0.120764 0.086288 0.090111 0.084004 0.059423 0.074012 0.061428 0.096519 0.071408 0.091162 0.076794 0.080410 0.092647
qa: -0.4092 -0.3967 -0.1964 0.1025 0.5800 -0.2283 -0.2467 0.2661 -0.2733 -0.3077 0.1981 -0.0047 -0.3785 -0.3581 -0.3597 -0.2389 -0.1082 -0.0579 -0.0880 -0.2822 -0.2860 0.0570 0.0866 0.0772 0.0826 0.0907 0.0813 0.0790 0.0963 0.0931 0.1033 0.0928 0.0873 0.0979 0.0932 0.0990 0.0991 0.0933 0.0950 0.0955 0.0948 0.0967 0.0972 0.1208 0.0863 0.0901 0.0840 0.0594 0.0740 0.0614 0.0965 0.0714 0.0912 0.0768 0.0804 0.0926
va: 1.9689 2.0048 2.8773 3.6732 3.7966 3.9319 3.9457 3.6679 4.0519 4.0180 3.7070 4.0234 3.9486 3.9240 3.9222 4.0522 3.9232 3.8893 3.8362 3.9020 3.9531 1.0173 1.0120 1.0218 0.9977 1.0146 1.0145 1.0212 1.0203 1.0141 0.9983 0.9966 0.9942 1.0055 0.9996 1.0010 1.0021 0.9981 1.0072 1.0008 1.0063 1.0035 0.9976 0.9980 1.0014 0.9975 0.9946 1.0033 1.0087 1.0051 1.0056 1.0032 1.0163 1.0062 1.0013 1.0054
dispcorr: -0.030626615 hartree
energy: -912.342888610633
dipole: 4.01980 -4.18182 -0.16201 -11.30115 11.58713 0.28598 -2.14176 1.53646 -0.60529
magnitude: 0.68878 au
magnitude: 1.75073 debye
