program: Orca
programVersion: 5.0.2
elementType: O O N C C C C C C C C C C C C C C C C C C H H H H H H H H H H H H H H H H H H H H H H H H H H H H H H H H H H H
charge: 0
multiplicity: 1
keywords: wb97x-d3
keywords: def2-TZVPP
keywords: def2/J RIJCOSX
keywords: DEFGRID2
keywords: scfconv7
keywords: smallprint printgap noloewdin
keywords: NOSOSCF
formula: C18H35NO2
InChI: InChI=1/C18H35NO2/c1-6-12-19(7-2)13-16-14-20-18(21-16)10-8-15(9-11-18)17(3,4)5/h15-16H,6-14H2,1-5H3
56 atoms
O  -0.306673 0.560297 0.385466
O  -0.118042 2.775509 0.631217
N  -2.985777 -0.924824 -0.344835
C  3.29789 0.306632 -0.022022
C  0.638877 1.602796 0.398298
C  2.297335 0.495473 -1.166302
C  2.525633 0.182982 1.295163
C  4.323293 -0.835063 -0.254888
C  1.389535 1.698315 -0.928132
C  1.613476 1.382184 1.540008
C  -1.486581 1.074074 -0.209365
C  -1.452142 2.544128 0.225681
C  3.661813 -2.214478 -0.277302
C  5.053381 -0.617237 -1.583996
C  5.37745 -0.813125 0.855712
C  -2.734646 0.361443 0.273579
C  -4.379253 -1.327247 -0.20925
C  -2.056625 -1.978933 0.039079
C  -5.309322 -0.618693 -1.186611
C  -2.02768 -2.366418 1.514366
C  -6.744946 -1.105017 -1.056436
H  3.88918 1.232801 0.037473
H  2.816203 0.646452 -2.114177
H  1.688493 -0.40574 -1.290289
H  1.928794 -0.734053 1.295893
H  3.210587 0.101784 2.140948
H  0.688247 1.811878 -1.760478
H  1.995056 2.609911 -0.90906
H  2.221941 2.285213 1.646666
H  1.059688 1.257814 2.474693
H  -1.434295 0.992048 -1.302455
H  -2.124573 2.732371 1.069793
H  -1.740898 3.210734 -0.591404
H  3.20438 -2.469027 0.680447
H  2.887082 -2.288817 -1.04308
H  4.401486 -2.989254 -0.493289
H  5.874982 -1.329401 -1.691183
H  5.482737 0.386261 -1.646497
H  4.402222 -0.752831 -2.44866
H  4.959835 -1.047439 1.835848
H  6.16016 -1.549836 0.659685
H  5.860914 0.164643 0.928139
H  -3.567134 1.020358 0.014495
H  -2.718524 0.325911 1.375297
H  -4.438695 -2.401176 -0.406642
H  -4.757333 -1.188422 0.816659
H  -2.310478 -2.862743 -0.55228
H  -1.051122 -1.697813 -0.277496
H  -4.949152 -0.790226 -2.204346
H  -5.283817 0.463025 -1.028358
H  -1.710312 -1.543056 2.15585
H  -3.001271 -2.710913 1.868052
H  -1.319797 -3.182934 1.667642
H  -6.824702 -2.175302 -1.257581
H  -7.403351 -0.591358 -1.758158
H  -7.137982 -0.929564 -0.052876
elementType: O N C H
totalener: -912.31508836 hartree
nucrepener: 1891.15822463 hartree
electener: -2803.47331300 hartree
oneelecener: -4995.86018698 hartree
twoeener: 2192.38687398 hartree
cpcmener: -0.01593246 hartree
kineticenergy: 907.78664465 hartree
xcener: -92.068547399274 hartree
chargesum: -0.0000000
charge: -0.390959 -0.400818 -0.211112 0.087428 0.548032 -0.241941 -0.229365 0.261278 -0.274516 -0.242348 0.181431 0.016921 -0.373235 -0.361702 -0.357006 -0.191498 -0.093493 -0.045911 -0.061337 -0.286662 -0.281677 0.056070 0.087068 0.080825 0.081880 0.088347 0.090487 0.084954 0.084296 0.077248 0.060045 0.078517 0.084661 0.094573 0.096888 0.097748 0.094925 0.100037 0.093878 0.094022 0.094459 0.097394 0.116580 0.089540 0.086702 0.068707 0.079859 0.072975 0.045935 0.055374 0.079304 0.089428 0.095117 0.080154 0.091296 0.079199
qa: -0.3910 -0.4008 -0.2111 0.0874 0.5480 -0.2419 -0.2294 0.2613 -0.2745 -0.2423 0.1814 0.0169 -0.3732 -0.3617 -0.3570 -0.1915 -0.0935 -0.0459 -0.0613 -0.2867 -0.2817 0.0561 0.0871 0.0808 0.0819 0.0883 0.0905 0.0850 0.0843 0.0772 0.0600 0.0785 0.0847 0.0946 0.0969 0.0977 0.0949 0.1000 0.0939 0.0940 0.0945 0.0974 0.1166 0.0895 0.0867 0.0687 0.0799 0.0730 0.0459 0.0554 0.0793 0.0894 0.0951 0.0802 0.0913 0.0792
va: 1.9966 2.0011 2.8853 3.6811 3.8163 3.9595 3.9442 3.6730 4.0243 4.0116 3.8232 3.9873 3.9471 3.9247 3.9235 3.9827 3.9222 3.9250 3.8461 3.8879 3.9497 1.0174 1.0133 1.0103 1.0082 1.0132 1.0074 1.0230 1.0183 1.0328 1.0250 0.9949 0.9934 0.9996 1.0011 1.0046 1.0071 1.0020 0.9984 1.0016 1.0063 1.0032 0.9903 1.0096 0.9953 0.9949 0.9991 1.0140 1.0239 1.0146 1.0066 1.0008 1.0091 1.0011 1.0040 1.0014
dispcorr: -0.028501222 hartree
energy: -912.343589584566
dipole: 0.84970 -1.25289 -0.40319 -13.36914 13.22231 -0.14682 -2.03837 1.81048 -0.22789
magnitude: 0.48585 au
magnitude: 1.23494 debye
