program: Orca
programVersion: 5.0.2
elementType: O O N C C C C C C C C C C C C C C C C C C H H H H H H H H H H H H H H H H H H H H H H H H H H H H H H H H H H H
charge: 0
multiplicity: 1
keywords: wb97x-d3
keywords: def2-TZVPP
keywords: def2/J RIJCOSX
keywords: DEFGRID2
keywords: scfconv7
keywords: smallprint printgap noloewdin
keywords: NOSOSCF
formula: C18H35NO2
InChI: InChI=1/C18H35NO2/c1-6-12-19(7-2)13-16-14-20-18(21-16)10-8-15(9-11-18)17(3,4)5/h15-16H,6-14H2,1-5H3
56 atoms
O  -0.359411 0.957216 -0.480413
O  -0.13993 2.954731 0.509786
N  -2.940699 -0.839042 -0.222736
C  3.146801 0.294903 -0.140444
C  0.590798 1.815151 0.126545
C  2.484472 1.001844 -1.327285
C  2.072301 -0.080405 0.884961
C  4.056814 -0.895186 -0.547921
C  1.64566 2.201254 -0.892452
C  1.246893 1.126629 1.320639
C  -1.669023 1.307724 -0.055886
C  -1.427317 2.505171 0.867537
C  5.073632 -0.442579 -1.600469
C  4.846306 -1.381728 0.671565
C  3.255291 -2.069337 -1.114388
C  -2.405922 0.184354 0.653905
C  -4.049534 -1.562595 0.383012
C  -1.942256 -1.728796 -0.800775
C  -5.357551 -0.780703 0.3785
C  -1.191308 -2.639296 0.165763
C  -6.500624 -1.587636 0.976029
H  3.807628 1.032617 0.339051
H  3.238779 1.358244 -2.030189
H  1.8563 0.299016 -1.883138
H  1.403967 -0.838679 0.465876
H  2.52285 -0.528931 1.772254
H  1.166531 2.665884 -1.758652
H  2.297987 2.956562 -0.44333
H  1.89435 1.852381 1.822903
H  0.491575 0.819173 2.050111
H  -2.249635 1.606951 -0.936019
H  -1.475298 2.213694 1.925083
H  -2.144644 3.310808 0.7091
H  5.616252 0.449981 -1.278003
H  5.813844 -1.226222 -1.778666
H  4.610823 -0.219354 -2.5628
H  5.436805 -0.574231 1.112158
H  5.540491 -2.176445 0.388242
H  4.204181 -1.786728 1.455105
H  2.596786 -2.518687 -0.36874
H  2.637978 -1.776862 -1.966231
H  3.927153 -2.858164 -1.46158
H  -3.248529 0.657091 1.165607
H  -1.763215 -0.215332 1.45555
H  -4.204868 -2.479486 -0.192842
H  -3.826939 -1.888542 1.412217
H  -2.450995 -2.350268 -1.54312
H  -1.22213 -1.133694 -1.363133
H  -5.597366 -0.497414 -0.649688
H  -5.250324 0.152417 0.938288
H  -0.64716 -2.080541 0.928776
H  -1.858385 -3.336611 0.675961
H  -0.457987 -3.234532 -0.381707
H  -6.29368 -1.869817 2.010451
H  -6.677861 -2.507541 0.414991
H  -7.431696 -1.019491 0.97378
elementType: O N C H
totalener: -912.31425264 hartree
nucrepener: 1913.62818565 hartree
electener: -2825.94243828 hartree
oneelecener: -5040.70499441 hartree
twoeener: 2214.76255613 hartree
cpcmener: -0.01609401 hartree
kineticenergy: 907.78790519 hartree
xcener: -92.070022517182 hartree
chargesum: -0.0000000
charge: -0.404248 -0.385577 -0.212563 0.098210 0.565118 -0.214382 -0.221026 0.264606 -0.276464 -0.285528 0.240935 -0.030063 -0.357768 -0.361611 -0.377394 -0.227019 -0.086367 -0.057880 -0.064413 -0.296300 -0.280104 0.057128 0.086141 0.078218 0.042282 0.089990 0.077349 0.084041 0.086936 0.091314 0.070263 0.080103 0.107218 0.099509 0.094329 0.094686 0.096962 0.094648 0.095390 0.089928 0.100086 0.099041 0.115690 0.095263 0.085851 0.068616 0.079814 0.081953 0.045524 0.054682 0.081613 0.098655 0.097304 0.078542 0.079942 0.090827
qa: -0.4042 -0.3856 -0.2126 0.0982 0.5651 -0.2144 -0.2210 0.2646 -0.2765 -0.2855 0.2409 -0.0301 -0.3578 -0.3616 -0.3774 -0.2270 -0.0864 -0.0579 -0.0644 -0.2963 -0.2801 0.0571 0.0861 0.0782 0.0423 0.0900 0.0773 0.0840 0.0869 0.0913 0.0703 0.0801 0.1072 0.0995 0.0943 0.0947 0.0970 0.0946 0.0954 0.0899 0.1001 0.0990 0.1157 0.0953 0.0859 0.0686 0.0798 0.0820 0.0455 0.0547 0.0816 0.0987 0.0973 0.0785 0.0799 0.0908
va: 1.9798 2.0165 2.8835 3.6904 3.7695 3.9132 3.9946 3.6767 4.0552 4.0125 3.7563 3.9936 3.9229 3.9237 3.9494 3.9985 3.9130 3.9190 3.8522 3.8782 3.9487 1.0169 1.0133 1.0176 1.0186 1.0147 1.0301 1.0160 1.0230 1.0143 1.0209 0.9993 0.9938 1.0021 1.0076 0.9972 1.0031 1.0060 1.0012 0.9983 1.0010 1.0061 0.9923 1.0000 0.9952 0.9943 0.9996 1.0157 1.0238 1.0147 0.9961 1.0007 1.0105 1.0015 1.0011 1.0043
dispcorr: -0.029947352 hartree
energy: -912.344199989171
dipole: 2.13870 -2.38733 -0.24863 -16.60865 16.17005 -0.43860 1.53205 -0.78073 0.75131
magnitude: 0.90480 au
magnitude: 2.29982 debye
